{"text_format":"3","workbook":"xlsx","n_sheets":15,"sheets":["USV","Hilfe","Help","Übersetzung","Release Notes","Berechnung","NH00C-500V","NH1-4a-500V","NH00C-690V","NH1-3-690V","SE-500V","SE-690V","SE-DC700V","SE-DC800V","KETO"],"not_rendered":{"images":5,"defined_names":3},"read":"whole","date_system":"1900"}

{"sheet":"USV","index":0,"n_rows":40,"n_cols":16,"rows_kept":40,"merged":[[3,0,3,11],[3,14,3,15],[5,0,6,1],[5,3,8,3],[7,0,12,1],[9,13,9,15],[10,13,10,15],[11,13,14,15],[20,3,22,3],[25,7,26,10],[28,7,28,14],[29,0,39,0],[29,3,29,6],[29,7,29,14],[30,7,30,8],[30,9,30,10],[30,11,30,12],[30,13,30,14],[32,1,36,1],[32,3,36,3],[33,5,36,5],[37,1,39,1],[37,3,39,3],[37,5,39,5]]}
[]
[]
[]
[{"$f":"VLOOKUP(\"Absicherung Batteriestromkreis von USV-Anlagen\",Übersetzung!$A:$Y,MATCH($M$5,Übersetzung!$1:$1,0),0)","v":"Absicherung Batteriestromkreis von USV-Anlagen"},{"$nulls":13},"V2.1.0"]
[{"$nulls":12},"deutsch",null,"Hilfe","Help"]
["!",null,null,{"$f":"VLOOKUP(\"USV-Daten\",Übersetzung!$A:$Y,MATCH($M$5,Übersetzung!$1:$1,0),0)","v":"USV-Daten"},null,{"$f":"VLOOKUP(\"Nennleistung\",Übersetzung!$A:$Y,MATCH($M$5,Übersetzung!$1:$1,0),0)","v":"Nennleistung"},null,200,"kVA"]
[{"$nulls":3},{"$f":"VLOOKUP(\"Wirkungsgrad\",Übersetzung!$A:$Y,MATCH($M$5,Übersetzung!$1:$1),0)","v":{"$error":"#N/A"}},null,{"$f":"VLOOKUP(\"cos phi\",Übersetzung!$A:$Y,MATCH($M$5,Übersetzung!$1:$1,0),0)","v":"cos phi"},null,0.9]
[{"$f":"VLOOKUP(\"Bitte alle orangen Eingabefelder vollständig ausfüllen\",Übersetzung!$A:$Y,MATCH($M$5,Übersetzung!$1:$1,0),0)","v":"Bitte alle orangen Eingabefelder vollständig ausfüllen"},null,null,{"$f":"VLOOKUP(\"Wirkungsgrad\",Übersetzung!$A:$Y,MATCH($M$5,Übersetzung!$1:$1),0)","v":{"$error":"#N/A"}},null,{"$f":"VLOOKUP(\"Zwischenkreisspannung\",Übersetzung!$A:$Y,MATCH($M$5,Übersetzung!$1:$1,0),0)","v":"Zwischenkreisspannung"},null,400,"V"]
[{"$nulls":3},{"$f":"VLOOKUP(\"Wirkungsgrad\",Übersetzung!$A:$Y,MATCH($M$5,Übersetzung!$1:$1),0)","v":{"$error":"#N/A"}},null,{"$f":"VLOOKUP(\"Wirkungsgrad DC/AC\",Übersetzung!$A:$Y,MATCH($M$5,Übersetzung!$1:$1,0),0)","v":"Wirkungsgrad DC/AC"},null,{"v":0.9,"d":"90.0%"}]
[{"$nulls":11},{"$f":"VLOOKUP(\"Datum\",Übersetzung!$A:$Y,MATCH($M$5,Übersetzung!$1:$1,0),0)","v":"Datum"},null,{"$f":"TODAY()","v":"2019-02-20"}]
[{"$nulls":11},{"$f":"VLOOKUP(\"Projekt-Bezeichnung\",Übersetzung!$A:$Y,MATCH($M$5,Übersetzung!$1:$1,0),0)","v":"Projekt-Bezeichnung"}]
[{"$nulls":11},{"$f":"VLOOKUP(\"Notizen\",Übersetzung!$A:$Y,MATCH($M$5,Übersetzung!$1:$1,0),0)","v":"Notizen"}]
[]
[]
[]
{"$rows_left_out":26}
{"sheet":"Hilfe","index":1,"n_rows":31,"n_cols":7,"rows_kept":31,"merged":[[1,6,1,10],[2,6,9,10],[10,6,10,10],[11,6,13,10],[14,6,18,10],[21,1,21,10],[22,1,23,10],[24,1,24,10],[25,1,25,10],[26,1,26,10],[27,1,27,10],[28,1,28,10],[29,1,29,10]]}
[]
[{"$nulls":6},"Betriebspunkt (tB/IB)"]
[{"$nulls":6},"Der maximale Betriebsstrom IB ergibt sich aus der USV-Wirkleistung und Entladeschlussspannung: IB = PW/UE.\ntB entspricht dabei der Überbrückungszeit der USV-Anlage. Hierbei ist der ungünstigste Fall des Betriebs unter Wegfall evtl. vorgesehener Redundanzen zu berücksichtigen"]
{"$rows_empty":7}
[{"$nulls":6},"Überlasten (tO/IO)"]
[{"$nulls":6},"Zulässige Überlasten (IO) und ihre Dauer (tO) sind ebenfalls zu berücksichtigen.\n"]
[]
[]
[{"$nulls":6},"Alle Betriebspunkte müssen in ausreichendem Abstand unterhalb Kennlinie liegen.\nHieraus erfolgt die Auswahl des notwendigen Bemessungsstroms der Sicherung."]
{"$rows_empty":7}
[null,"Eingaben der USV- und Batteriedaten erfolgen in den orangen Feldern. Optional können Notizen in den gelben Feldern eingetragen werden."]
[]
["1)","Eingabe Leistungsdaten der USV-Anlage. Die Zwischenkreisspannung ist dabei ausschlaggebend für die Bemesssungspannung der Sicherung. Die Erhaltungsladespannung dagegen ist nicht für das Schaltverhalten der Sicherung relevant. Sie sollte jedoch maximal der Isolationsspannung des verwendeten Schaltgeräts entsprechen.\nFür die Berechnung ist grundsätzlich nur der Wirkungsgrad des Wechselrichters relevant (Von der Batterie zum Verbraucher). Falls nur der Gesamt-Wirkungsgrad AC/AC bekannt ist, liegt die Berechnung aber auf der sicheren Seite."]
["2)","Wenn der Sicherungsfall über eine mech. Sicherungsüberwachung weitergemeldet werden soll, ist hier ja auszuwählen. Dadurch werden automatisch Sicherungseinsätze mit Kraftmelder und das entsprechende Zubehör für die NH-Sicherungslasttrennschalter vorgeschlagen."]
["3)","Eingabe der für die Batterie relevanten Daten. Die Entladeschlussspannung dient zur Berechnung des max. Entladestroms unter Berücksichtigung der angegebenen redundanten Batteriestränge"]
{"$rows_left_out":5}
{"sheet":"Help","index":2,"n_rows":31,"n_cols":7,"rows_kept":31,"merged":[[1,6,1,10],[2,6,9,10],[10,6,10,10],[11,6,13,10],[14,6,18,10],[21,1,21,10],[22,1,23,10],[24,1,24,10],[25,1,25,10],[26,1,26,10],[27,1,27,10],[28,1,28,10],[29,1,29,10]]}
[]
[{"$nulls":6},"Operating point (tB/IB)"]
[{"$nulls":6},"The maximum operating current IB is calculated from the UPS effective power and the final discharge voltage: IB = PW/UE.\ntB corresponds to the backup time of the UPS system.  Here the operation with outage of potential redundant battery\nstrings has to be considered."]
{"$rows_empty":7}
[{"$nulls":6},"Overload (tO/IO)"]
[{"$nulls":6},"Permissible overload (IO) and their duration (tO) have also to be considered.\n"]
[]
[]
[{"$nulls":6},"All operating points have to be located below the time current characteristics curve with sufficient distance.\nFrom this results the selection of the required rated current for the fuse."]
{"$rows_empty":7}
[null,"Input of UPS and battery data takes place in the orange input fields. Optional notes can be placed in the yellow fields."]
[]
["1)","Input of UPS ratings. The DC link voltage is crucial for the rated voltage of the fuse-link. On the contrary the float voltage is not relevant for the breaking behaviour of the fuse-link. It should not exceed the isolation voltage of the applied switchgear.\nBasically only the efficiency of the inverter (battery to load) is relevant for the calculation. If only the complete efficiency AC/AC is known the calculation will still be on the safe side.\n"]
["2)","If fuse-tripping should be monitored by a mechanical fuse-monitoring you should select yes. Thereby automatically fuse-links with striker indicator and respective accessories for the fuse-switch-disconnectors are recommended."]
["3)","Input of all relevant data for the battery. The final discharge voltage is the base for calculating the max. discharge current while considering the specified redundant battery strings."]
{"$rows_left_out":5}
{"sheet":"Übersetzung","index":3,"n_rows":44,"n_cols":2,"rows_kept":44,"hidden":true}
["deutsch","english"]
["Absicherung Batteriestromkreis von USV-Anlagen","Protection of UPS battery circuit"]
["USV-Daten","UPS data"]
["Nennleistung","Rated power"]
["cos phi","Power factor"]
["Zwischenkreisspannung","DC link circuit voltage"]
["Wirkungsgrad DC/AC","Efficiency DC/AC"]
["Sicherung","Fuse"]
["Batterie-Daten","Battery data"]
["Mechanische Sicherungsüberwachung","Mechanical fuse-monitoring"]
["ja","yes"]
["nein","no"]
["Entladeschlussspannung","Final discharge voltage"]
["Überbrückungszeit","Backup time"]
["max. Entladestrom","max. discharge current"]
{"$rows_left_out":30}
{"sheet":"Release Notes","index":4,"n_rows":7,"n_cols":2,"rows_kept":7,"hidden":true}
["Version","Änderungen"]
["2.0","Komplette Überarbeitung mit Integration der neuen Batteriesicherungen 700V und 800V"]
["2.0.1","Fehlerkorrekturen"]
["2.0.2","Ergänzung von Hinweisen zur Leistungsabgabe bei Überbrückungszeiten >60min und zum DC-Lastschaltvermögen"]
["2.0.3","Fehlerkorrektur: Bei kleinen Strömen immer Ausgabe der 35A-Sicherung in Größe NH1"]
["2.0.4","Ergänzung, dass nur Wirkungsgrad des Wechselrichters benötigt wird (DC/AC-Wandlung von Batterie zu Verbraucherseite). Falls AC/AC-Wirkungsgrad eingesetzt ist, liegt die Berechnung aber auf sicherer Seite."]
["2.1.0","Integration von KETO"]

{"sheet":"Berechnung","index":5,"n_rows":21,"n_cols":31,"rows_kept":21,"hidden":true,"merged":[[3,1,3,6],[3,7,3,12],[3,13,3,18],[3,19,3,24],[3,25,3,30],[14,1,14,6],[14,7,14,12],[14,13,14,18],[14,19,14,24],[14,25,14,30]]}
["max. Entladestrom","Überlast 1","Überlast 2"]
[{"$f":"USV!J23","v":{"v":571.4285714285714,"d":"571.43"}},{"$f":"USV!M23","v":0},{"$f":"USV!O23","v":0}]
[]
[null,"NH000",{"$nulls":5},"NH1",{"$nulls":5},"NH2",{"$nulls":5},"NH3",{"$nulls":5},"NH4a"]
[null,"Entladung","Überlast 1","Überlast 2","Max.","Standard","/K","Entladung","Überlast 1","Überlast 2","Max.","Standard","/K","Entladung","Überlast 1","Überlast 2","Max.","Standard","/K","Entladung","Überlast 1","Überlast 2","Max.","Standard","/K","Entladung","Überlast 1","Überlast 2","Max.","Standard","/K"]
["500V",{"$f":"OFFSET('NH00C-500V'!$A$5,0,MATCH(A$2,'NH00C-500V'!$B$24:$O$24,-1))","v":{"$error":"#N/A"}},{"$f":"OFFSET('NH00C-500V'!$A$5,0,MATCH(B$2,'NH00C-500V'!$B$27:$O$27,-1))","v":6},{"$f":"OFFSET('NH00C-500V'!$A$5,0,MATCH(C$2,'NH00C-500V'!$B$30:$O$30,-1))","v":6},{"$f":"MAX(B6:D6)","v":{"$error":"#N/A"}},{"$f":"IF(ISNA(E6),\"-\",VLOOKUP(E6,'SE-500V'!$A:$K,2,0))","v":"-"},{"$f":"IF(ISNA(E6),\"-\",VLOOKUP(E6,'SE-500V'!$A:$K,7,0))","v":"-"},{"$f":"OFFSET('NH1-4a-500V'!$A$5,0,MATCH(A$2,'NH1-4a-500V'!$B$24:$W$24,-1))","v":500},{"$f":"OFFSET('NH1-4a-500V'!$A$5,0,MATCH(B$2,'NH1-4a-500V'!$B$27:$W$27,-1))","v":25},{"$f":"OFFSET('NH1-4a-500V'!$A$5,0,MATCH(C$2,'NH1-4a-500V'!$B$30:$W$30,-1))","v":25},{"$f":"MAX(H6:J6)","v":500},{"$f":"IF(ISNA(K6),\"-\",VLOOKUP(K6,'SE-500V'!$A:$K,3,0))","v":"-"},{"$f":"IF(ISNA(K6),\"-\",VLOOKUP(K6,'SE-500V'!$A:$K,8,0))","v":"-"},{"$f":"OFFSET('NH1-4a-500V'!$A$5,0,MATCH(A$2,'NH1-4a-500V'!$B$24:$V$24,-1))","v":500},{"$f":"OFFSET('NH1-4a-500V'!$A$5,0,MATCH(B$2,'NH1-4a-500V'!$B$27:$V$27,-1))","v":35},{"$f":"OFFSET('NH1-4a-500V'!$A$5,0,MATCH(C$2,'NH1-4a-500V'!$B$30:$V$30,-1))","v":35},{"$f":"MAX(N6:P6)","v":500},{"$f":"IF(ISNA(Q6),\"-\",VLOOKUP(Q6,'SE-500V'!$A:$K,4,0))","v":"-"},{"$f":"IF(ISNA(Q6),\"-\",VLOOKUP(Q6,'SE-500V'!$A:$K,9,0))","v":"-"},{"$f":"OFFSET('NH1-4a-500V'!$A$5,0,MATCH(A$2,'NH1-4a-500V'!$B$24:$V$24,-1))","v":500},{"$f":"OFFSET('NH1-4a-500V'!$A$5,0,MATCH(B$2,'NH1-4a-500V'!$B$27:$V$27,-1))","v":35},{"$f":"OFFSET('NH1-4a-500V'!$A$5,0,MATCH(C$2,'NH1-4a-500V'!$B$30:$V$30,-1))","v":35},{"$f":"MAX(T6:V6)","v":500},{"$f":"IF(ISNA(W6),\"-\",VLOOKUP(W6,'SE-500V'!$A:$K,5,0))","v":"R3216600"},{"$f":"IF(ISNA(W6),\"-\",VLOOKUP(W6,'SE-500V'!$A:$K,10,0))","v":"R3216604"},{"$f":"OFFSET('NH1-4a-500V'!$A$5,0,MATCH(A$2,'NH1-4a-500V'!$B$24:$V$24,-1))","v":500},{"$f":"OFFSET('NH1-4a-500V'!$A$5,0,MATCH(B$2,'NH1-4a-500V'!$B$27:$V$27,-1))","v":35},{"$f":"OFFSET('NH1-4a-500V'!$A$5,0,MATCH(C$2,'NH1-4a-500V'!$B$30:$V$30,-1))","v":35},null,{"$f":"IF(ISNA(Z6),\"-\",VLOOKUP(Z6,'SE-500V'!$A:$K,6,0))","v":"-"},{"$f":"IF(ISNA(Z6),\"-\",VLOOKUP(Z6,'SE-500V'!$A:$K,11,0))","v":"-"}]
["690V",{"$f":"OFFSET('NH00C-690V'!$A$5,0,MATCH(A$2,'NH00C-690V'!$B$24:$M$24,-1))","v":{"$error":"#N/A"}},{"$f":"OFFSET('NH00C-690V'!$A$5,0,MATCH(B$2,'NH00C-690V'!$B$27:$M$27,-1))","v":10},{"$f":"OFFSET('NH00C-690V'!$A$5,0,MATCH(C$2,'NH00C-690V'!$B$30:$M$30,-1))","v":10},{"$f":"MAX(B7:D7)","v":{"$error":"#N/A"}},{"$f":"IF(ISNA(E7),\"-\",VLOOKUP(E7,'SE-690V'!$A:$K,2,0))","v":"-"},{"$f":"IF(ISNA(E7),\"-\",VLOOKUP(E7,'SE-690V'!$A:$K,7,0))","v":"-"},{"$f":"OFFSET('NH1-3-690V'!$A$5,0,MATCH(A$2,'NH1-3-690V'!$B$24:$R$24,-1))","v":500},{"$f":"OFFSET('NH1-3-690V'!$A$5,0,MATCH(B$2,'NH1-3-690V'!$B$27:$R$27,-1))","v":25},{"$f":"OFFSET('NH1-3-690V'!$A$5,0,MATCH(C$2,'NH1-3-690V'!$B$30:$R$30,-1))","v":25},{"$f":"MAX(H7:J7)","v":500},{"$f":"IF(ISNA(K7),\"-\",VLOOKUP(K7,'SE-690V'!$A:$K,3,0))","v":"-"},{"$f":"IF(ISNA(K7),\"-\",VLOOKUP(K7,'SE-690V'!$A:$K,8,0))","v":"-"},{"$f":"OFFSET('NH1-3-690V'!$A$5,0,MATCH(A$2,'NH1-3-690V'!$B$24:$Q$24,-1))","v":500},{"$f":"OFFSET('NH1-3-690V'!$A$5,0,MATCH(B$2,'NH1-3-690V'!$B$27:$Q$27,-1))","v":35},{"$f":"OFFSET('NH1-3-690V'!$A$5,0,MATCH(C$2,'NH1-3-690V'!$B$30:$Q$30,-1))","v":35},{"$f":"MAX(N7:P7)","v":500},{"$f":"IF(ISNA(Q7),\"-\",VLOOKUP(Q7,'SE-690V'!$A:$K,4,0))","v":"-"},{"$f":"IF(ISNA(Q7),\"-\",VLOOKUP(Q7,'SE-690V'!$A:$K,9,0))","v":"-"},{"$f":"OFFSET('NH1-3-690V'!$A$5,0,MATCH(A$2,'NH1-3-690V'!$B$24:$Q$24,-1))","v":500},{"$f":"OFFSET('NH1-3-690V'!$A$5,0,MATCH(B$2,'NH1-3-690V'!$B$27:$Q$27,-1))","v":35},{"$f":"OFFSET('NH1-3-690V'!$A$5,0,MATCH(C$2,'NH1-3-690V'!$B$30:$Q$30,-1))","v":35},{"$f":"MAX(T7:V7)","v":500},{"$f":"IF(ISNA(W7),\"-\",VLOOKUP(W7,'SE-690V'!$A:$K,5,0))","v":"R3286600"},{"$f":"IF(ISNA(W7),\"-\",VLOOKUP(W7,'SE-690V'!$A:$K,10,0))","v":"R3286604"},"-","-","-","-","-","-"]
["700V",{"$f":"OFFSET('NH00C-690V'!$A$5,0,MATCH(A$2,'NH00C-690V'!$B$24:$M$24,-1))","v":{"$error":"#N/A"}},{"$f":"OFFSET('NH00C-690V'!$A$5,0,MATCH(B$2,'NH00C-690V'!$B$27:$M$27,-1))","v":10},{"$f":"OFFSET('NH00C-690V'!$A$5,0,MATCH(C$2,'NH00C-690V'!$B$30:$M$30,-1))","v":10},{"$error":"#N/A"},{"$f":"IF(ISNA(E8),\"-\",VLOOKUP(E8,'SE-DC700V'!$A:$K,2,0))","v":"-"},{"$f":"IF(ISNA(E8),\"-\",VLOOKUP(E8,'SE-DC700V'!$A:$K,7,0))","v":"-"},{"$f":"OFFSET('NH1-3-690V'!$A$5,0,MATCH(A$2,'NH1-3-690V'!$B$24:$R$24,-1))","v":500},{"$f":"OFFSET('NH1-3-690V'!$A$5,0,MATCH(B$2,'NH1-3-690V'!$B$27:$R$27,-1))","v":25},{"$f":"OFFSET('NH1-3-690V'!$A$5,0,MATCH(C$2,'NH1-3-690V'!$B$30:$R$30,-1))","v":25},500,{"$f":"IF(ISNA(K8),\"-\",VLOOKUP(K8,'SE-DC700V'!$A:$K,3,0))","v":"-"},{"$f":"IF(ISNA(K8),\"-\",VLOOKUP(K8,'SE-DC700V'!$A:$K,8,0))","v":"-"},{"$f":"OFFSET('NH1-3-690V'!$A$5,0,MATCH(A$2,'NH1-3-690V'!$B$24:$Q$24,-1))","v":500},{"$f":"OFFSET('NH1-3-690V'!$A$5,0,MATCH(B$2,'NH1-3-690V'!$B$27:$Q$27,-1))","v":35},{"$f":"OFFSET('NH1-3-690V'!$A$5,0,MATCH(C$2,'NH1-3-690V'!$B$30:$Q$30,-1))","v":35},500,{"$f":"IF(ISNA(Q8),\"-\",VLOOKUP(Q8,'SE-DC700V'!$A:$K,4,0))","v":"-"},{"$f":"IF(ISNA(Q8),\"-\",VLOOKUP(Q8,'SE-DC700V'!$A:$K,9,0))","v":"-"},{"$f":"OFFSET('NH1-3-690V'!$A$5,0,MATCH(A$2,'NH1-3-690V'!$B$24:$Q$24,-1))","v":500},{"$f":"OFFSET('NH1-3-690V'!$A$5,0,MATCH(B$2,'NH1-3-690V'!$B$27:$Q$27,-1))","v":35},{"$f":"OFFSET('NH1-3-690V'!$A$5,0,MATCH(C$2,'NH1-3-690V'!$B$30:$Q$30,-1))","v":35},500,{"$f":"IF(ISNA(W8),\"-\",VLOOKUP(W8,'SE-DC700V'!$A:$K,5,0))","v":"R3236602"},{"$f":"IF(ISNA(W8),\"-\",VLOOKUP(W8,'SE-DC700V'!$A:$K,10,0))","v":"R3236603"},"-","-","-","-","-","-"]
["800V",{"$f":"OFFSET('NH00C-690V'!$A$5,0,MATCH(A$2,'NH00C-690V'!$B$24:$M$24,-1))","v":{"$error":"#N/A"}},{"$f":"OFFSET('NH00C-690V'!$A$5,0,MATCH(B$2,'NH00C-690V'!$B$27:$M$27,-1))","v":10},{"$f":"OFFSET('NH00C-690V'!$A$5,0,MATCH(C$2,'NH00C-690V'!$B$30:$M$30,-1))","v":10},{"$error":"#N/A"},{"$f":"IF(ISNA(E9),\"-\",VLOOKUP(E9,'SE-DC800V'!$A:$K,2,0))","v":"-"},{"$f":"IF(ISNA(E9),\"-\",VLOOKUP(E9,'SE-DC800V'!$A:$K,7,0))","v":"-"},{"$f":"OFFSET('NH1-3-690V'!$A$5,0,MATCH(A$2,'NH1-3-690V'!$B$24:$R$24,-1))","v":500},{"$f":"OFFSET('NH1-3-690V'!$A$5,0,MATCH(B$2,'NH1-3-690V'!$B$27:$R$27,-1))","v":25},{"$f":"OFFSET('NH1-3-690V'!$A$5,0,MATCH(C$2,'NH1-3-690V'!$B$30:$R$30,-1))","v":25},500,{"$f":"IF(ISNA(K9),\"-\",VLOOKUP(K9,'SE-DC800V'!$A:$K,3,0))","v":"-"},{"$f":"IF(ISNA(K9),\"-\",VLOOKUP(K9,'SE-DC800V'!$A:$K,8,0))","v":"-"},{"$f":"OFFSET('NH1-3-690V'!$A$5,0,MATCH(A$2,'NH1-3-690V'!$B$24:$Q$24,-1))","v":500},{"$f":"OFFSET('NH1-3-690V'!$A$5,0,MATCH(B$2,'NH1-3-690V'!$B$27:$Q$27,-1))","v":35},{"$f":"OFFSET('NH1-3-690V'!$A$5,0,MATCH(C$2,'NH1-3-690V'!$B$30:$Q$30,-1))","v":35},500,{"$f":"IF(ISNA(Q9),\"-\",VLOOKUP(Q9,'SE-DC800V'!$A:$K,4,0))","v":"-"},{"$f":"IF(ISNA(Q9),\"-\",VLOOKUP(Q9,'SE-DC800V'!$A:$K,9,0))","v":"-"},{"$f":"OFFSET('NH1-3-690V'!$A$5,0,MATCH(A$2,'NH1-3-690V'!$B$24:$Q$24,-1))","v":500},{"$f":"OFFSET('NH1-3-690V'!$A$5,0,MATCH(B$2,'NH1-3-690V'!$B$27:$Q$27,-1))","v":35},{"$f":"OFFSET('NH1-3-690V'!$A$5,0,MATCH(C$2,'NH1-3-690V'!$B$30:$Q$30,-1))","v":35},500,{"$f":"IF(ISNA(W9),\"-\",VLOOKUP(W9,'SE-DC800V'!$A:$K,5,0))","v":"-"},{"$f":"IF(ISNA(W9),\"-\",VLOOKUP(W9,'SE-DC800V'!$A:$K,10,0))","v":"-"},"-","-","-","-","-","-"]
["-","-","-","-","-","-","-","-","-","-","-","-","-","-","-","-","-","-","-","-","-","-","-","-","-","-","-","-","-","-","-"]
[]
[]
["max. Entladestrom 50%","Überlast 1","Überlast 2"]
[{"$f":"A2/2","v":{"v":285.7142857142857,"d":"285.71"}},{"$f":"B2/2","v":{"v":0,"d":"0.00"}},{"v":0,"d":"0.00"}]
[null,"2xNH000",{"$nulls":5},"2xNH1",{"$nulls":5},"2xNH2",{"$nulls":5},"NH3",{"$nulls":5},"NH4a"]
{"$rows_left_out":7}
{"sheet":"NH00C-500V","index":6,"n_rows":30,"n_cols":15,"rows_kept":30,"hidden":true}
[]
[]
["NH00C/500V-uf2"]
[]
["(s)",160,125,100,80,63,50,40,35,32,25,20,16,10,6]
[10,355,300,235,190,135,115,105,86,73,42,33,26,23.5,22]
[60,255,220,175,130,107,83,75,62.5,53,36,30,23,22,21]
[120,230,200,155,121,96,75,68,56,50,34.5,29,22.5,21.5,20]
[180,223,190,145,119,92,71,63,53,46,34,28,22,21,19.5]
[240,220,180,140,118,90,69,62,52,44,33.5,27.5,22,20.5,19]
[300,217,175,138,115,87,67,61,51,43,33,27,22,20,18]
[600,208,160,130,110,82,63,57,47.5,41.5,32,25.5,21.5,19.5,17]
[900,202,155,129,108,80,62,55,46.5,41,32,25,21.5,19,17]
[1200,200,152,128,105,79,61.5,55,45,40,32,25,21.5,18.5,17]
[1800,199,150,126,102,77,61,53.5,44.5,39.5,32,24.5,21,18.5,17]
{"$rows_left_out":16}
{"sheet":"NH1-4a-500V","index":7,"n_rows":30,"n_cols":23,"rows_kept":30,"hidden":true}
[]
[]
["NH1-3/500V-uf2"]
[{"$nulls":22},"NH000"]
["(s)",1500,1250,1000,800,630,500,425,400,350,315,250,224,200,160,125,100,80,63,50,40,35,25]
[10,4371,3491,2788,2227,1600,1220,1050,1000,820,710,610,520,430,340,290,230,175,133,115,96,82.5,42]
[60,3191,2548,2035,1625,1190,925,800,720,615,525,435,380,320,250,215,165,128,105,82,71,62,36]
[120,2852,2277,1819,1452,1100,840,720,660,550,480,410,340,300,230,200,151,121,95,74.5,64.5,55,34.5]
[180,2666,2129,1700,1358,1050,800,690,625,525,445,380,325,280,222,185,141,118,90,72,62,52.5,34]
[240,2548,2035,1625,1298,1000,775,670,617,517,437,365,321,270,220,178,140,117,88,70,61,52,33.5]
[300,2436,1946,1554,1241,960,750,650,600,505,430,355,317,260,217,171,135,115,85,68,59,51.5,33]
[600,2227,1778,1420,1134,900,720,620,570,470,415,335,305,241,203,160,130,109,81.5,63.5,55,48,32]
[900,2129,1700,1358,1084,860,700,610,545,450,405,330,298,239,200,154,129,107,80,62,53.5,46,32]
[1200,2081,1662,1328,1060,850,690,600,540,445,400,325,290,235,200,153,129,105,77.5,61.5,53,45,32]
[1800,1990,1589,1269,1014,830,660,580,527,435,387,323,277,232,197,152,128,102,75.5,60.5,52,44,32]
{"$rows_left_out":16}
{"sheet":"NH00C-690V","index":8,"n_rows":30,"n_cols":13,"rows_kept":30,"hidden":true}
[]
[]
["NH00C/690V-uf2"]
[]
["(s)",160,125,100,80,63,50,40,32,25,20,16,10]
[10,390,300,240,200,140,115,90,75,59,43,34,30.5]
[60,315,230,200,147,117,92,70,60,45,34,27,23]
[120,290,215,180,137,113,86,65,56,42.5,32.5,25.5,22]
[180,270,210,170,135,110,82,63,53,41.5,31.5,24,21.5]
[240,262,205,165,132,109,80.5,62,52,41,31,23.5,21]
[300,255,200,160,130,105,79,61,51.5,40,30.5,23,20.5]
[600,245,190,150,125,96,74,57,49.5,38,29.5,22.5,20]
[900,240,185,148.5,124,94.5,73,55.5,48,37,29,22,19.5]
[1200,237,180,147,123,93,72.5,54,47,35.5,28,22,19]
[1800,235,177,145,122,92,72,53.5,46,35,27,22,19]
{"$rows_left_out":16}
{"sheet":"NH1-3-690V","index":9,"n_rows":30,"n_cols":18,"rows_kept":30,"hidden":true}
[]
[]
["NH1-3/690V-uf2"]
[{"$nulls":17},"NH000"]
["(s)",630,500,425,400,350,315,250,200,160,125,100,80,63,50,40,35,25]
[10,1700,1350,1250,1200,1100,1000,790,620,490,370,315,235,170,125,105,84,59]
[60,1210,1010,930,860,745,700,550,440,335,255,220,170,120,92,73,60,45]
[120,1170,960,850,800,700,630,516,417,317,233,200,150,115,84,67,54,42.5]
[180,1150,900,800,730,640,600,480,390,295,223,190,140,110,79,62.5,51.5,41.5]
[240,1100,860,770,720,625,580,460,370,285,220,181,135,102,76,61.5,50,41]
[300,1050,835,735,700,610,560,440,355,270,215,170,131,100,73,60,48,40]
[600,930,780,680,630,550,520,417,328,245,200,155,125,92,69,53.5,44,38]
[900,900,730,650,615,530,500,400,320,237,185,149,121,88,65,52,43,37]
[1200,860,725,630,600,520,490,390,315,231,182,144,120,85,63.5,51.5,42,35.5]
[1800,835,700,617,570,510,460,361,300,224,171,139,119,82,62,49,40,35]
{"$rows_left_out":16}
{"sheet":"SE-500V","index":10,"n_rows":29,"n_cols":11,"rows_kept":29,"hidden":true,"merged":[[0,1,0,5],[0,6,0,10]]}
[null,"Anzeiger oben",{"$nulls":4},"Kraftmelder"]
["Bemessungsstrom_A","NH000","NH1","NH2","NH3","NH4a","NH000","NH1","NH2","NH3","NH4a"]
[6,"R5211450","-","-","-","-","R5211413","-","-","-","-"]
[10,"R5211750","-","-","-","-","R5211713","-","-","-","-"]
[16,"R5212250","-","-","-","-","R5212213","-","-","-","-"]
[20,"R5212450","-","-","-","-","R5212413","-","-","-","-"]
[25,"R5212650","-","-","-","-","R5212613","-","-","-","-"]
[32,"R5212950","-","-","-","-","R5212913","-","-","-","-"]
[35,"R5213150","-","-","-","-","R5213113","-","-","-","-"]
[40,"R5213450","-","-","-","-","R5213413","-","-","-","-"]
[50,"R5213550","-","-","-","-","R5213513","-","-","-","-"]
[63,"R5213850","R1213800","-","-","-","R5213813","R1213804","-","-","-"]
[80,"R5214150","R1214100","-","-","-","R5214113","R1214104","-","-","-"]
[100,"R5214350","R1214300","-","-","-","R5214313","R1214304","-","-","-"]
[125,"R5214650","R1214600","R2214600","-","-","R5214613","R1214604","R2214604","-","-"]
{"$rows_left_out":15}
{"sheet":"SE-690V","index":11,"n_rows":29,"n_cols":11,"rows_kept":29,"hidden":true,"merged":[[0,1,0,5],[0,6,0,10]]}
[null,"Anzeiger oben",{"$nulls":4},"Kraftmelder"]
["Bemessungsstrom_A","NH000","NH1","NH2","NH3","NH4a","NH000","NH1","NH2","NH3","NH4a"]
[6,"-","-","-","-","-","-","-","-","-","-"]
[10,"-","-","-","-","-","-","-","-","-","-"]
[16,"R5282250","-","-","-","-","R5282213","-","-","-","-"]
[20,"R5282450","-","-","-","-","R5282413","-","-","-","-"]
[25,"R5282650","-","-","-","-","R5282613","-","-","-","-"]
[32,"R5282950","-","-","-","-","R5282913","-","-","-","-"]
[35,"R5283150","R1283100","-","-","-","R5283113","R1283104","-","-","-"]
[40,"R5283450","R1283400","-","-","-","R5283413","R1283404","-","-","-"]
[50,"R5283550","R1283500","-","-","-","R5283513","R1283504","-","-","-"]
[63,"R5283850","R1283800","-","-","-","R5283813","R1283804","-","-","-"]
[80,"R5284150","R1284100","-","-","-","R5284113","R1284104","-","-","-"]
[100,"R5284350","R1284300","-","-","-","R5284313","R1284304","-","-","-"]
[125,"R5284650","R1284600","R2284600","-","-","R5284613","R1284604","R2284604","-","-"]
{"$rows_left_out":15}
{"sheet":"SE-DC700V","index":12,"n_rows":29,"n_cols":11,"rows_kept":29,"hidden":true,"merged":[[0,1,0,5],[0,6,0,10]]}
[null,"Anzeiger oben",{"$nulls":4},"Kraftmelder"]
["Bemessungsstrom_A","NH000","NH1","NH2","NH3","NH4a","NH000","NH1","NH2","NH3","NH4a"]
[6,"-","-","-","-","-","-","-","-","-","-"]
[10,"-","-","-","-","-","-","-","-","-","-"]
[16,"-","-","-","-","-","-","-","-","-","-"]
[20,"-","-","-","-","-","-","-","-","-","-"]
[25,"-","-","-","-","-","-","-","-","-","-"]
[32,"-","-","-","-","-","-","-","-","-","-"]
[35,"-","-","-","-","-","-","-","-","-","-"]
[40,"-","R1233402","-","-","-","-","R1233403","-","-","-"]
[50,"-","R1233502","-","-","-","-","R1233503","-","-","-"]
[63,"-","R1233802","-","-","-","-","R1233803","-","-","-"]
[80,"-","R1234102","-","-","-","-","R1234103","-","-","-"]
[100,"-","R1234302","-","-","-","-","R1234303","-","-","-"]
[125,"-","R1234602","R2234602","-","-","-","R1234603","R2234603","-","-"]
{"$rows_left_out":15}
{"sheet":"SE-DC800V","index":13,"n_rows":29,"n_cols":11,"rows_kept":29,"hidden":true,"merged":[[0,1,0,5],[0,6,0,10]]}
[null,"Anzeiger oben",{"$nulls":4},"Kraftmelder"]
["Bemessungsstrom_A","NH000","NH1","NH2","NH3","NH4a","NH000","NH1","NH2","NH3","NH4a"]
[6,"-","-","-","-","-","-","-","-","-","-"]
[10,"-","-","-","-","-","-","-","-","-","-"]
[16,"-","-","-","-","-","-","-","-","-","-"]
[20,"-","-","-","-","-","-","-","-","-","-"]
[25,"-","-","-","-","-","-","-","-","-","-"]
[32,"-","-","-","-","-","-","-","-","-","-"]
[35,"-","-","-","-","-","-","-","-","-","-"]
[40,"-","R1233406","-","-","-","-","R1233407","-","-","-"]
[50,"-","R1233506","-","-","-","-","R1233507","-","-","-"]
[63,"-","R1233806","-","-","-","-","R1233807","-","-","-"]
[80,"-","R1234106","-","-","-","-","R1234107","-","-","-"]
[100,"-","R1234306","-","-","-","-","R1234307","-","-","-"]
[125,"-","R1234606","R2234306","-","-","-","R1234607","R2234307","-","-"]
{"$rows_left_out":15}
{"sheet":"KETO","index":14,"n_rows":7,"n_cols":10,"rows_kept":7,"hidden":true}
[null,"1-polig","mech SÜ","2-polig","mech SÜ","3-polig","mech. SÜ","4-polig","mech. SÜ","TM"]
["NH000/NH00","T500111000","T8052170","T500112000","T8052170","T500113000","T8052170","T500114000","T8052170","N8584910"]
["NH1","T100111000","T8092170","T100112000","T8092170","T100113000","T8092170","T100114000","T8092170","N8185610"]
["NH2","T300111000","T8092170","T300112000","T8092170","T200113000","T8092170","T300114000","T8092170","N8286210"]
["NH3","T300111000","T8092170","T300112000","T8092170","T300113000","T8092170","T300114000","T8092170","N8386910"]
["NH4a","T4911004","T8420057","T4911019","T8420057","T4911000","T8420057","T4911017","T8420057","N8417900"]
["NH4a (1600A)","T4911005","T8420057","T4911031","T8420057","T4911001","T8420057","T4911018","T8420057","N8418300"]