{"text_format":"3","workbook":"xlsx","n_sheets":15,"sheets":["USV","Hilfe","Help","Übersetzung","Release Notes","Berechnung","NH00C-500V","NH1-4a-500V","NH00C-690V","NH1-3-690V","SE-500V","SE-690V","SE-DC700V","SE-DC800V","KETO"],"not_rendered":{"images":5,"defined_names":3},"read":"whole","date_system":"1900"}

{"sheet":"USV","index":0,"n_rows":40,"n_cols":16,"rows_kept":40,"merged":[[3,0,3,11],[3,14,3,15],[5,0,6,1],[5,3,8,3],[7,0,12,1],[9,13,9,15],[10,13,10,15],[11,13,14,15],[20,3,22,3],[25,7,26,10],[28,7,28,14],[29,0,39,0],[29,3,29,6],[29,7,29,14],[30,7,30,8],[30,9,30,10],[30,11,30,12],[30,13,30,14],[32,1,36,1],[32,3,36,3],[33,5,36,5],[37,1,39,1],[37,3,39,3],[37,5,39,5]]}
[]
[]
[]
[{"$f":"VLOOKUP(\"Absicherung Batteriestromkreis von USV-Anlagen\",Übersetzung!$A:$Y,MATCH($M$5,Übersetzung!$1:$1,0),0)","v":"Absicherung Batteriestromkreis von USV-Anlagen"},{"$nulls":13},"V2.1.0"]
[{"$nulls":12},"deutsch",null,"Hilfe","Help"]
["!",null,null,{"$f":"VLOOKUP(\"USV-Daten\",Übersetzung!$A:$Y,MATCH($M$5,Übersetzung!$1:$1,0),0)","v":"USV-Daten"},null,{"$f":"VLOOKUP(\"Nennleistung\",Übersetzung!$A:$Y,MATCH($M$5,Übersetzung!$1:$1,0),0)","v":"Nennleistung"},null,200,"kVA"]
[{"$nulls":3},{"$f":"VLOOKUP(\"Wirkungsgrad\",Übersetzung!$A:$Y,MATCH($M$5,Übersetzung!$1:$1),0)","v":{"$error":"#N/A"}},null,{"$f":"VLOOKUP(\"cos phi\",Übersetzung!$A:$Y,MATCH($M$5,Übersetzung!$1:$1,0),0)","v":"cos phi"},null,0.9]
[{"$f":"VLOOKUP(\"Bitte alle orangen Eingabefelder vollständig ausfüllen\",Übersetzung!$A:$Y,MATCH($M$5,Übersetzung!$1:$1,0),0)","v":"Bitte alle orangen Eingabefelder vollständig ausfüllen"},null,null,{"$f":"VLOOKUP(\"Wirkungsgrad\",Übersetzung!$A:$Y,MATCH($M$5,Übersetzung!$1:$1),0)","v":{"$error":"#N/A"}},null,{"$f":"VLOOKUP(\"Zwischenkreisspannung\",Übersetzung!$A:$Y,MATCH($M$5,Übersetzung!$1:$1,0),0)","v":"Zwischenkreisspannung"},null,400,"V"]
[{"$nulls":3},{"$f":"VLOOKUP(\"Wirkungsgrad\",Übersetzung!$A:$Y,MATCH($M$5,Übersetzung!$1:$1),0)","v":{"$error":"#N/A"}},null,{"$f":"VLOOKUP(\"Wirkungsgrad DC/AC\",Übersetzung!$A:$Y,MATCH($M$5,Übersetzung!$1:$1,0),0)","v":"Wirkungsgrad DC/AC"},null,{"v":0.9,"d":"90.0%"}]
[{"$nulls":11},{"$f":"VLOOKUP(\"Datum\",Übersetzung!$A:$Y,MATCH($M$5,Übersetzung!$1:$1,0),0)","v":"Datum"},null,{"$f":"TODAY()","v":"2019-02-20"}]
[{"$nulls":11},{"$f":"VLOOKUP(\"Projekt-Bezeichnung\",Übersetzung!$A:$Y,MATCH($M$5,Übersetzung!$1:$1,0),0)","v":"Projekt-Bezeichnung"}]
[{"$nulls":11},{"$f":"VLOOKUP(\"Notizen\",Übersetzung!$A:$Y,MATCH($M$5,Übersetzung!$1:$1,0),0)","v":"Notizen"}]
[]
[]
[]
[]
[{"$nulls":7},{"$f":"VLOOKUP(\"Mechanische Sicherungsüberwachung\",Übersetzung!$A:$Y,MATCH($M$5,Übersetzung!$1:$1,0),0)","v":"Mechanische Sicherungsüberwachung"},null,null,"ja/yes"]
[{"$nulls":3},{"$f":"VLOOKUP(\"Sicherung\",Übersetzung!$A:$Y,MATCH($M$5,Übersetzung!$1:$1,0),0)","v":"Sicherung"}]
[{"$nulls":7},{"$f":"VLOOKUP(\"Anzahl Batteriestränge\",Übersetzung!$A:$Y,MATCH($M$5,Übersetzung!$1:$1,0),0)","v":"Anzahl Batteriestränge"},null,2,null,null,{"$f":"VLOOKUP(\"Überlast\",Übersetzung!$A:$Y,MATCH($M$5,Übersetzung!$1:$1,0),0)","v":"Überlast"},1,{"$f":"VLOOKUP(\"Überlast\",Übersetzung!$A:$Y,MATCH($M$5,Übersetzung!$1:$1,0),0)","v":"Überlast"},2]
[{"$nulls":7},{"$f":"VLOOKUP(\"Davon redundant\",Übersetzung!$A:$Y,MATCH($M$5,Übersetzung!$1:$1,0),0)","v":"Davon redundant"},null,1,null,{"$f":"VLOOKUP(\"Einkalkulieren\",Übersetzung!$A:$Y,MATCH($M$5,Übersetzung!$1:$1,0),0)","v":"Einkalkulieren"},"nein/no",null,"nein/no"]
[{"$nulls":3},{"$f":"VLOOKUP(\"Batterie-Daten\",Übersetzung!$A:$Y,MATCH($M$5,Übersetzung!$1:$1,0),0)","v":"Batterie-Daten"},{"$nulls":3},{"$f":"VLOOKUP(\"Entladeschlussspannung\",Übersetzung!$A:$Y,MATCH($M$5,Übersetzung!$1:$1,0),0)","v":"Entladeschlussspannung"},null,350,"V"]
[{"$nulls":3},{"$f":"VLOOKUP(\"Sicherung\",Übersetzung!$A:$Y,MATCH($M$5,Übersetzung!$1:$1),0)","v":"Sicherung"},{"$nulls":3},{"$f":"VLOOKUP(\"Überbrückungszeit\",Übersetzung!$A:$Y,MATCH($M$5,Übersetzung!$1:$1,0),0)","v":"Überbrückungszeit"},null,15,{"$f":"CONCATENATE(\"min\",IF(J22>60,\"*\",\"\"))","v":"min"},{"$f":"VLOOKUP(\"Faktor\",Übersetzung!$A:$Y,MATCH($M$5,Übersetzung!$1:$1,0),0)","v":"Faktor"},1.25,null,{"v":1.5,"d":"1.50"}]
[{"$nulls":3},{"$f":"VLOOKUP(\"Sicherung\",Übersetzung!$A:$Y,MATCH($M$5,Übersetzung!$1:$1),0)","v":"Sicherung"},{"$nulls":3},{"$f":"VLOOKUP(\"max. Entladestrom\",Übersetzung!$A:$Y,MATCH($M$5,Übersetzung!$1:$1,0),0)","v":"max. Entladestrom"},null,{"$f":"IF(J24=\"ja/yes\",J25,(IF(I6=\"kW\",H6*1000/(J21*H9),H7*H6*1000/(J21*H9)))/(J19-J20))","v":{"v":571.4285714285714,"d":"571.43"}},"A",{"$f":"VLOOKUP(\"Strom\",Übersetzung!$A:$Y,MATCH($M$5,Übersetzung!$1:$1,0),0)","v":"Strom"},{"$f":"IF(M20=\"nein/no\",0,M$22*$J$23)","v":{"v":0,"d":"0.00"}},"A",{"$f":"IF(O20=\"nein/no\",0,O$22*$J$23)","v":{"v":0,"d":"0.00"}},"A"]
[{"$nulls":7},{"$f":"VLOOKUP(\"Manuelle Eingabe\",Übersetzung!$A:$Y,MATCH($M$5,Übersetzung!$1:$1,0),0)","v":"Manuelle Eingabe"},null,"nein/no",null,{"$f":"VLOOKUP(\"Dauer\",Übersetzung!$A:$Y,MATCH($M$5,Übersetzung!$1:$1,0),0)","v":"Dauer"},10,"min",1,"min"]
[{"$nulls":7},{"$f":"VLOOKUP(\"max. Entladestrom\",Übersetzung!$A:$Y,MATCH($M$5,Übersetzung!$1:$1,0),0)","v":"max. Entladestrom"},null,100,"A"]
[{"$nulls":7},{"$f":"IF($J$22>60,VLOOKUP(\"*Achtung! Bei Überbrückungszeit >60min Leistungsabgabe beachten. Ggf. Hersteller kontaktieren.\",Übersetzung!$A:$Y,MATCH($M$5,Übersetzung!$1:$1,0),0),\"\")","v":""}]
[]
[]
[{"$nulls":7},{"$f":"IF($H$8>440,VLOOKUP(\"*Achtung! Kein Lastschaltvermögen bei DC-Spannung > 440V. Angaben zur Gebrauchskategorie beachten!\",Übersetzung!$A:$Y,MATCH($M$5,Übersetzung!$1:$1,0),0),\"\")","v":""}]
[{"$f":"VLOOKUP(\"Bestelldaten\",Übersetzung!$A:$Y,MATCH($M$5,Übersetzung!$1:$1,0),0)","v":"Bestelldaten"},null,null,{"$f":"VLOOKUP(\"Sicherungseinsatz\",Übersetzung!$A:$Y,MATCH($M$5,Übersetzung!$1:$1,0),0)","v":"Sicherungseinsatz"},{"$nulls":3},{"$f":"CONCATENATE(VLOOKUP(\"NH-Sicherungslasttrennschalter\",Übersetzung!$A:$Y,MATCH($M$5,Übersetzung!$1:$1,0),0),IF($H$8>440,\"*\",\"\"))","v":"NH-Sicherungslasttrennschalter"},{"$nulls":7},{"$f":"VLOOKUP(\"Trennmesser\",Übersetzung!$A:$Y,MATCH($M$5,Übersetzung!$1:$1,0),0)","v":"Trennmesser"}]
[{"$nulls":7},{"$f":"VLOOKUP(\"1-polig\",Übersetzung!$A:$Y,MATCH($M$5,Übersetzung!$1:$1,0),0)","v":"1-polig"},null,{"$f":"VLOOKUP(\"2-polig\",Übersetzung!$A:$Y,MATCH($M$5,Übersetzung!$1:$1,0),0)","v":"2-polig"},null,{"$f":"VLOOKUP(\"3-polig\",Übersetzung!$A:$Y,MATCH($M$5,Übersetzung!$1:$1,0),0)","v":"3-polig"},null,{"$f":"VLOOKUP(\"4-polig\",Übersetzung!$A:$Y,MATCH($M$5,Übersetzung!$1:$1,0),0)","v":"4-polig"}]
[null,null,{"$f":"VLOOKUP(\"Baugröße\",Übersetzung!$A:$Y,MATCH($M$5,Übersetzung!$1:$1,0),0)","v":"Baugröße"},{"$f":"IF($H$8<=550,\"Un AC\",IF($H$8<=800,\"Un DC\",\"-\"))","v":"Un AC"},"Art.-Nr (ohne Link)","In",{"$f":"VLOOKUP(\"Art.-Nr.\",Übersetzung!$A:$Y,MATCH($M$5,Übersetzung!$1:$1,0),0)","v":"Art.-Nr."},{"$f":"VLOOKUP(\"LTL\",Übersetzung!$A:$Y,MATCH($M$5,Übersetzung!$1:$1,0),0)","v":"LTL"},{"$f":"VLOOKUP(\"mech. SÜ\",Übersetzung!$A:$Y,MATCH($M$5,Übersetzung!$1:$1,0),0)","v":"mech. SÜ"},{"$f":"VLOOKUP(\"LTL\",Übersetzung!$A:$Y,MATCH($M$5,Übersetzung!$1:$1,0),0)","v":"LTL"},{"$f":"VLOOKUP(\"mech. SÜ\",Übersetzung!$A:$Y,MATCH($M$5,Übersetzung!$1:$1,0),0)","v":"mech. SÜ"},{"$f":"VLOOKUP(\"LTL\",Übersetzung!$A:$Y,MATCH($M$5,Übersetzung!$1:$1,0),0)","v":"LTL"},{"$f":"VLOOKUP(\"mech. SÜ\",Übersetzung!$A:$Y,MATCH($M$5,Übersetzung!$1:$1,0),0)","v":"mech. SÜ"},{"$f":"VLOOKUP(\"LTL\",Übersetzung!$A:$Y,MATCH($M$5,Übersetzung!$1:$1,0),0)","v":"LTL"},{"$f":"VLOOKUP(\"mech. SÜ\",Übersetzung!$A:$Y,MATCH($M$5,Übersetzung!$1:$1,0),0)","v":"mech. SÜ"}]
[null,{"$f":"VLOOKUP(\"Einfach\",Übersetzung!$A:$Y,MATCH($M$5,Übersetzung!$1:$1,0),0)","v":"Einfach"},"NH00",{"$f":"IF($H$8<=440,\"500V\",IF($H$8<=550,\"690V\",IF($H$8<=700,\"700V\",IF($H$8<=800,\"800V\",\"-\"))))","v":"500V"},{"$f":"VLOOKUP($D$33,Berechnung!$A$6:$AE$10,6+IF($K$17=\"nein/no\",0,1),0)","v":"-"},{"$f":"IF(ISNA(VLOOKUP($D$33,Berechnung!$A$6:$AE$10,5,0)),\"-\",CONCATENATE(VLOOKUP($D$33,Berechnung!$A$6:$AE$10,5,0),\"A\"))","v":"-"},{"$f":"IF(E33=\"-\",\"-\",HYPERLINK(CONCATENATE(\"http://www.jeanmueller.de/produkte/jean/\",IF($M$5=\"deutsch\",\"de_DE\",\"en_GB\"),\"/all/a/PR/\",E33,\"/index.xhtml?pk_campaign=battery-protection\"),E33))","v":"-"},{"$f":"IF($G33=\"-\",\"-\",HYPERLINK(CONCATENATE(\"http://www.jeanmueller.de/produkte/jean/\",IF($M$5=\"deutsch\",\"de_DE\",\"en_GB\"),\"/all/a/PR/\",KETO!B2,\"/index.xhtml?pk_campaign=battery-protection\"),KETO!B2))","v":"-"},{"$f":"IF($K$17=\"ja/yes\",IF($G33=\"-\",\"-\",HYPERLINK(CONCATENATE(\"http://www.jeanmueller.de/produkte/jean/\",IF($M$5=\"deutsch\",\"de_DE\",\"en_GB\"),\"/all/a/PR/\",KETO!C2,\"/index.xhtml?pk_campaign=battery-protection\"),KETO!C2)),\"-\")","v":"-"},{"$f":"IF($G33=\"-\",\"-\",HYPERLINK(CONCATENATE(\"http://www.jeanmueller.de/produkte/jean/\",IF($M$5=\"deutsch\",\"de_DE\",\"en_GB\"),\"/all/a/PR/\",KETO!D2,\"/index.xhtml?pk_campaign=battery-protection\"),KETO!D2))","v":"-"},{"$f":"IF($K$17=\"ja/yes\",IF($G33=\"-\",\"-\",HYPERLINK(CONCATENATE(\"http://www.jeanmueller.de/produkte/jean/\",IF($M$5=\"deutsch\",\"de_DE\",\"en_GB\"),\"/all/a/PR/\",KETO!E2,\"/index.xhtml?pk_campaign=battery-protection\"),KETO!E2)),\"-\")","v":"-"},{"$f":"IF($G33=\"-\",\"-\",HYPERLINK(CONCATENATE(\"http://www.jeanmueller.de/produkte/jean/\",IF($M$5=\"deutsch\",\"de_DE\",\"en_GB\"),\"/all/a/PR/\",KETO!F2,\"/index.xhtml?pk_campaign=battery-protection\"),KETO!F2))","v":"-"},{"$f":"IF($K$17=\"ja/yes\",IF($G33=\"-\",\"-\",HYPERLINK(CONCATENATE(\"http://www.jeanmueller.de/produkte/jean/\",IF($M$5=\"deutsch\",\"de_DE\",\"en_GB\"),\"/all/a/PR/\",KETO!G2,\"/index.xhtml?pk_campaign=battery-protection\"),KETO!G2)),\"-\")","v":"-"},"-","-",{"$f":"IF($G33=\"-\",\"-\",HYPERLINK(CONCATENATE(\"http://www.jeanmueller.de/produkte/jean/\",IF($M$5=\"deutsch\",\"de_DE\",\"en_GB\"),\"/all/a/PR/\",KETO!J2,\"/index.xhtml?pk_campaign=battery-protection\"),KETO!J2))","v":"-"}]
[null,{"$f":"VLOOKUP(\"Leistung\",Übersetzung!$A:$Y,MATCH($M$5,Übersetzung!$1:$1),0)","v":{"$error":"#N/A"}},"NH1",null,{"$f":"VLOOKUP($D$33,Berechnung!$A$6:$AE$10,12+IF($K$17=\"nein/no\",0,1),0)","v":"-"},{"$f":"IF(OR(ISNA(VLOOKUP($D$33,Berechnung!$A$6:$AE$10,11,0)),VLOOKUP($D$33,Berechnung!$A$6:$AE$10,11,0)=25),\"-\",CONCATENATE(VLOOKUP($D$33,Berechnung!$A$6:$AE$10,11,0),\"A\"))","v":"500A"},"-",{"$f":"IF($G34=\"-\",\"-\",HYPERLINK(CONCATENATE(\"http://www.jeanmueller.de/produkte/jean/\",IF($M$5=\"deutsch\",\"de_DE\",\"en_GB\"),\"/all/a/PR/\",KETO!B3,\"/index.xhtml?pk_campaign=battery-protection\"),KETO!B3))","v":"-"},{"$f":"IF($K$17=\"ja/yes\",IF($G34=\"-\",\"-\",HYPERLINK(CONCATENATE(\"http://www.jeanmueller.de/produkte/jean/\",IF($M$5=\"deutsch\",\"de_DE\",\"en_GB\"),\"/all/a/PR/\",KETO!C3,\"/index.xhtml?pk_campaign=battery-protection\"),KETO!C3)),\"-\")","v":"-"},{"$f":"IF($G34=\"-\",\"-\",HYPERLINK(CONCATENATE(\"http://www.jeanmueller.de/produkte/jean/\",IF($M$5=\"deutsch\",\"de_DE\",\"en_GB\"),\"/all/a/PR/\",KETO!D3,\"/index.xhtml?pk_campaign=battery-protection\"),KETO!D3))","v":"-"},{"$f":"IF($K$17=\"ja/yes\",IF($G34=\"-\",\"-\",HYPERLINK(CONCATENATE(\"http://www.jeanmueller.de/produkte/jean/\",IF($M$5=\"deutsch\",\"de_DE\",\"en_GB\"),\"/all/a/PR/\",KETO!E3,\"/index.xhtml?pk_campaign=battery-protection\"),KETO!E3)),\"-\")","v":"-"},{"$f":"IF($G34=\"-\",\"-\",HYPERLINK(CONCATENATE(\"http://www.jeanmueller.de/produkte/jean/\",IF($M$5=\"deutsch\",\"de_DE\",\"en_GB\"),\"/all/a/PR/\",KETO!F3,\"/index.xhtml?pk_campaign=battery-protection\"),KETO!F3))","v":"-"},{"$f":"IF($K$17=\"ja/yes\",IF($G34=\"-\",\"-\",HYPERLINK(CONCATENATE(\"http://www.jeanmueller.de/produkte/jean/\",IF($M$5=\"deutsch\",\"de_DE\",\"en_GB\"),\"/all/a/PR/\",KETO!G3,\"/index.xhtml?pk_campaign=battery-protection\"),KETO!G3)),\"-\")","v":"-"},"-","-",{"$f":"IF($G34=\"-\",\"-\",HYPERLINK(CONCATENATE(\"http://www.jeanmueller.de/produkte/jean/\",IF($M$5=\"deutsch\",\"de_DE\",\"en_GB\"),\"/all/a/PR/\",KETO!J3,\"/index.xhtml?pk_campaign=battery-protection\"),KETO!J3))","v":"-"}]
[null,{"$f":"VLOOKUP(\"Leistung\",Übersetzung!$A:$Y,MATCH($M$5,Übersetzung!$1:$1),0)","v":{"$error":"#N/A"}},"NH2",null,{"$f":"VLOOKUP($D$33,Berechnung!$A$6:$AE$10,18+IF($K$17=\"nein/no\",0,1),0)","v":"-"},null,"-",{"$f":"IF($G35=\"-\",\"-\",HYPERLINK(CONCATENATE(\"http://www.jeanmueller.de/produkte/jean/\",IF($M$5=\"deutsch\",\"de_DE\",\"en_GB\"),\"/all/a/PR/\",KETO!B4,\"/index.xhtml?pk_campaign=battery-protection\"),KETO!B4))","v":"-"},{"$f":"IF($K$17=\"ja/yes\",IF($G35=\"-\",\"-\",HYPERLINK(CONCATENATE(\"http://www.jeanmueller.de/produkte/jean/\",IF($M$5=\"deutsch\",\"de_DE\",\"en_GB\"),\"/all/a/PR/\",KETO!C4,\"/index.xhtml?pk_campaign=battery-protection\"),KETO!C4)),\"-\")","v":"-"},{"$f":"IF($G35=\"-\",\"-\",HYPERLINK(CONCATENATE(\"http://www.jeanmueller.de/produkte/jean/\",IF($M$5=\"deutsch\",\"de_DE\",\"en_GB\"),\"/all/a/PR/\",KETO!D4,\"/index.xhtml?pk_campaign=battery-protection\"),KETO!D4))","v":"-"},{"$f":"IF($K$17=\"ja/yes\",IF($G35=\"-\",\"-\",HYPERLINK(CONCATENATE(\"http://www.jeanmueller.de/produkte/jean/\",IF($M$5=\"deutsch\",\"de_DE\",\"en_GB\"),\"/all/a/PR/\",KETO!E4,\"/index.xhtml?pk_campaign=battery-protection\"),KETO!E4)),\"-\")","v":"-"},{"$f":"IF($G35=\"-\",\"-\",HYPERLINK(CONCATENATE(\"http://www.jeanmueller.de/produkte/jean/\",IF($M$5=\"deutsch\",\"de_DE\",\"en_GB\"),\"/all/a/PR/\",KETO!F4,\"/index.xhtml?pk_campaign=battery-protection\"),KETO!F4))","v":"-"},{"$f":"IF($K$17=\"ja/yes\",IF($G35=\"-\",\"-\",HYPERLINK(CONCATENATE(\"http://www.jeanmueller.de/produkte/jean/\",IF($M$5=\"deutsch\",\"de_DE\",\"en_GB\"),\"/all/a/PR/\",KETO!G4,\"/index.xhtml?pk_campaign=battery-protection\"),KETO!G4)),\"-\")","v":"-"},"-","-",{"$f":"IF($G35=\"-\",\"-\",HYPERLINK(CONCATENATE(\"http://www.jeanmueller.de/produkte/jean/\",IF($M$5=\"deutsch\",\"de_DE\",\"en_GB\"),\"/all/a/PR/\",KETO!J4,\"/index.xhtml?pk_campaign=battery-protection\"),KETO!J4))","v":"-"}]
[null,{"$f":"VLOOKUP(\"Leistung\",Übersetzung!$A:$Y,MATCH($M$5,Übersetzung!$1:$1),0)","v":{"$error":"#N/A"}},"NH3",null,{"$f":"VLOOKUP($D$33,Berechnung!$A$6:$AE$10,24+IF($K$17=\"nein/no\",0,1),0)","v":"R3216604"},null,"R3216604",{"$f":"IF($G36=\"-\",\"-\",HYPERLINK(CONCATENATE(\"http://www.jeanmueller.de/produkte/jean/\",IF($M$5=\"deutsch\",\"de_DE\",\"en_GB\"),\"/all/a/PR/\",KETO!B5,\"/index.xhtml?pk_campaign=battery-protection\"),KETO!B5))","v":"T300111000"},{"$f":"IF($K$17=\"ja/yes\",IF($G36=\"-\",\"-\",HYPERLINK(CONCATENATE(\"http://www.jeanmueller.de/produkte/jean/\",IF($M$5=\"deutsch\",\"de_DE\",\"en_GB\"),\"/all/a/PR/\",KETO!C5,\"/index.xhtml?pk_campaign=battery-protection\"),KETO!C5)),\"-\")","v":"T8092170"},{"$f":"IF($G36=\"-\",\"-\",HYPERLINK(CONCATENATE(\"http://www.jeanmueller.de/produkte/jean/\",IF($M$5=\"deutsch\",\"de_DE\",\"en_GB\"),\"/all/a/PR/\",KETO!D5,\"/index.xhtml?pk_campaign=battery-protection\"),KETO!D5))","v":"T300112000"},{"$f":"IF($K$17=\"ja/yes\",IF($G36=\"-\",\"-\",HYPERLINK(CONCATENATE(\"http://www.jeanmueller.de/produkte/jean/\",IF($M$5=\"deutsch\",\"de_DE\",\"en_GB\"),\"/all/a/PR/\",KETO!E5,\"/index.xhtml?pk_campaign=battery-protection\"),KETO!E5)),\"-\")","v":"T8092170"},{"$f":"IF($G36=\"-\",\"-\",HYPERLINK(CONCATENATE(\"http://www.jeanmueller.de/produkte/jean/\",IF($M$5=\"deutsch\",\"de_DE\",\"en_GB\"),\"/all/a/PR/\",KETO!F5,\"/index.xhtml?pk_campaign=battery-protection\"),KETO!F5))","v":"T300113000"},{"$f":"IF($K$17=\"ja/yes\",IF($G36=\"-\",\"-\",HYPERLINK(CONCATENATE(\"http://www.jeanmueller.de/produkte/jean/\",IF($M$5=\"deutsch\",\"de_DE\",\"en_GB\"),\"/all/a/PR/\",KETO!G5,\"/index.xhtml?pk_campaign=battery-protection\"),KETO!G5)),\"-\")","v":"T8092170"},"-","-",{"$f":"IF($G36=\"-\",\"-\",HYPERLINK(CONCATENATE(\"http://www.jeanmueller.de/produkte/jean/\",IF($M$5=\"deutsch\",\"de_DE\",\"en_GB\"),\"/all/a/PR/\",KETO!J5,\"/index.xhtml?pk_campaign=battery-protection\"),KETO!J5))","v":"N8386910"}]
[null,{"$f":"VLOOKUP(\"Leistung\",Übersetzung!$A:$Y,MATCH($M$5,Übersetzung!$1:$1),0)","v":{"$error":"#N/A"}},"NH4a",null,{"$f":"VLOOKUP($D$33,Berechnung!$A$6:$AE$10,30+IF($K$17=\"nein/no\",0,1),0)","v":"-"},null,"-",{"$f":"IF($G37=\"-\",\"-\",HYPERLINK(CONCATENATE(\"http://www.jeanmueller.de/produkte/jean/\",IF($M$5=\"deutsch\",\"de_DE\",\"en_GB\"),\"/all/a/PR/\",IF(LEFT($E$37,6)=\"R42182\",KETO!B7,KETO!B6),\"/index.xhtml?pk_campaign=battery-protection\"),IF(LEFT($E$37,6)=\"R42182\",KETO!B7,KETO!B6)))","v":"-"},{"$f":"IF($K$17=\"ja/yes\",IF($G37=\"-\",\"-\",HYPERLINK(CONCATENATE(\"http://www.jeanmueller.de/produkte/jean/\",IF($M$5=\"deutsch\",\"de_DE\",\"en_GB\"),\"/all/a/PR/\",KETO!C6,\"/index.xhtml?pk_campaign=battery-protection\"),KETO!C6)),\"-\")","v":"-"},{"$f":"IF($G37=\"-\",\"-\",HYPERLINK(CONCATENATE(\"http://www.jeanmueller.de/produkte/jean/\",IF($M$5=\"deutsch\",\"de_DE\",\"en_GB\"),\"/all/a/PR/\",IF(LEFT($E$37,6)=\"R42182\",KETO!D7,KETO!D6),\"/index.xhtml?pk_campaign=battery-protection\"),IF(LEFT($E$37,6)=\"R42182\",KETO!D7,KETO!D6)))","v":"-"},{"$f":"IF($K$17=\"ja/yes\",IF($G37=\"-\",\"-\",HYPERLINK(CONCATENATE(\"http://www.jeanmueller.de/produkte/jean/\",IF($M$5=\"deutsch\",\"de_DE\",\"en_GB\"),\"/all/a/PR/\",KETO!E6,\"/index.xhtml?pk_campaign=battery-protection\"),KETO!E6)),\"-\")","v":"-"},{"$f":"IF($G37=\"-\",\"-\",HYPERLINK(CONCATENATE(\"http://www.jeanmueller.de/produkte/jean/\",IF($M$5=\"deutsch\",\"de_DE\",\"en_GB\"),\"/all/a/PR/\",IF(LEFT($E$37,6)=\"R42182\",KETO!F7,KETO!F6),\"/index.xhtml?pk_campaign=battery-protection\"),IF(LEFT($E$37,6)=\"R42182\",KETO!F7,KETO!F6)))","v":"-"},{"$f":"IF($K$17=\"ja/yes\",IF($G37=\"-\",\"-\",HYPERLINK(CONCATENATE(\"http://www.jeanmueller.de/produkte/jean/\",IF($M$5=\"deutsch\",\"de_DE\",\"en_GB\"),\"/all/a/PR/\",KETO!G6,\"/index.xhtml?pk_campaign=battery-protection\"),KETO!G6)),\"-\")","v":"-"},"-","-",{"$f":"IF($G37=\"-\",\"-\",HYPERLINK(CONCATENATE(\"http://www.jeanmueller.de/produkte/jean/\",IF($M$5=\"deutsch\",\"de_DE\",\"en_GB\"),\"/all/a/PR/\",IF(LEFT($E$37,6)=\"R42182\",KETO!J7,KETO!J6),\"/index.xhtml\"),IF(LEFT($E$37,6)=\"R42182\",KETO!J7,KETO!J6)))","v":"-"}]
[null,{"$f":"VLOOKUP(\"Parallel\",Übersetzung!$A:$Y,MATCH($M$5,Übersetzung!$1:$1,0),0)","v":"Parallel"},"2xNH2",{"$f":"IF($H$8<=440,\"500V\",IF($H$8<=550,\"690V\",IF($H$8<=700,\"700V\",IF($H$8<=800,\"800V\",\"-\"))))","v":"500V"},{"$f":"VLOOKUP($D$33,Berechnung!$A$17:$AE$21,18+IF($K$17=\"nein/no\",0,1),0)","v":"R2215904"},{"$f":"IF(OR(ISNA(VLOOKUP($D$33,Berechnung!$A$17:$AE$21,11,0)),VLOOKUP($D$33,Berechnung!$A$17:$AE$21,11,0)<315),\"-\",CONCATENATE(\"2x\",VLOOKUP($D$33,Berechnung!$A$17:$AE$21,11,0),\"A\"))","v":"2x315A"},"R2215904","-","-",{"$f":"IF($G38=\"-\",\"-\",HYPERLINK(CONCATENATE(\"http://www.jeanmueller.de/produkte/jean/\",IF($M$5=\"deutsch\",\"de_DE\",\"en_GB\"),\"/all/a/PR/\",KETO!D4,\"/index.xhtml?pk_campaign=battery-protection\"),KETO!D4))","v":"T300112000"},{"$f":"IF($K$17=\"ja/yes\",IF($G38=\"-\",\"-\",HYPERLINK(CONCATENATE(\"http://www.jeanmueller.de/produkte/jean/\",IF($M$5=\"deutsch\",\"de_DE\",\"en_GB\"),\"/all/a/PR/\",KETO!E4,\"/index.xhtml?pk_campaign=battery-protection\"),KETO!E4)),\"-\")","v":"T8092170"},"-","-",{"$f":"IF($G38=\"-\",\"-\",HYPERLINK(CONCATENATE(\"http://www.jeanmueller.de/produkte/jean/\",IF($M$5=\"deutsch\",\"de_DE\",\"en_GB\"),\"/all/a/PR/\",KETO!H4,\"/index.xhtml?pk_campaign=battery-protection\"),KETO!H4))","v":"T300114000"},{"$f":"IF($K$17=\"ja/yes\",IF($G38=\"-\",\"-\",HYPERLINK(CONCATENATE(\"http://www.jeanmueller.de/produkte/jean/\",IF($M$5=\"deutsch\",\"de_DE\",\"en_GB\"),\"/all/a/PR/\",KETO!I4,\"/index.xhtml?pk_campaign=battery-protection\"),KETO!I4)),\"-\")","v":"T8092170"},{"$f":"IF($G38=\"-\",\"-\",HYPERLINK(CONCATENATE(\"http://www.jeanmueller.de/produkte/jean/\",IF($M$5=\"deutsch\",\"de_DE\",\"en_GB\"),\"/all/a/PR/\",KETO!J4,\"/index.xhtml?pk_campaign=battery-protection\"),KETO!J4))","v":"N8286210"}]
[null,{"$f":"VLOOKUP(\"Leistung\",Übersetzung!$A:$Y,MATCH($M$5,Übersetzung!$1:$1),0)","v":{"$error":"#N/A"}},"2xNH3",null,{"$f":"VLOOKUP($D$33,Berechnung!$A$17:$AE$21,24+IF($K$17=\"nein/no\",0,1),0)","v":"R3215904"},null,"R3215904","-","-",{"$f":"IF($G39=\"-\",\"-\",HYPERLINK(CONCATENATE(\"http://www.jeanmueller.de/produkte/jean/\",IF($M$5=\"deutsch\",\"de_DE\",\"en_GB\"),\"/all/a/PR/\",KETO!D5,\"/index.xhtml?pk_campaign=battery-protection\"),KETO!D5))","v":"T300112000"},{"$f":"IF($K$17=\"ja/yes\",IF($G39=\"-\",\"-\",HYPERLINK(CONCATENATE(\"http://www.jeanmueller.de/produkte/jean/\",IF($M$5=\"deutsch\",\"de_DE\",\"en_GB\"),\"/all/a/PR/\",KETO!E5,\"/index.xhtml?pk_campaign=battery-protection\"),KETO!E5)),\"-\")","v":"T8092170"},"-","-",{"$f":"IF($G39=\"-\",\"-\",HYPERLINK(CONCATENATE(\"http://www.jeanmueller.de/produkte/jean/\",IF($M$5=\"deutsch\",\"de_DE\",\"en_GB\"),\"/all/a/PR/\",KETO!H5,\"/index.xhtml?pk_campaign=battery-protection\"),KETO!H5))","v":"T300114000"},{"$f":"IF($K$17=\"ja/yes\",IF($G39=\"-\",\"-\",HYPERLINK(CONCATENATE(\"http://www.jeanmueller.de/produkte/jean/\",IF($M$5=\"deutsch\",\"de_DE\",\"en_GB\"),\"/all/a/PR/\",KETO!I5,\"/index.xhtml?pk_campaign=battery-protection\"),KETO!I5)),\"-\")","v":"T8092170"},{"$f":"IF($G39=\"-\",\"-\",HYPERLINK(CONCATENATE(\"http://www.jeanmueller.de/produkte/jean/\",IF($M$5=\"deutsch\",\"de_DE\",\"en_GB\"),\"/all/a/PR/\",KETO!J5,\"/index.xhtml?pk_campaign=battery-protection\"),KETO!J5))","v":"N8386910"}]
[null,{"$f":"VLOOKUP(\"Leistung\",Übersetzung!$A:$Y,MATCH($M$5,Übersetzung!$1:$1),0)","v":{"$error":"#N/A"}},"2xNH4a",null,{"$f":"VLOOKUP($D$33,Berechnung!$A$17:$AE$21,30+IF($K$17=\"nein/no\",0,1),0)","v":"-"},null,"-","-","-",{"$f":"IF($G40=\"-\",\"-\",HYPERLINK(CONCATENATE(\"http://www.jeanmueller.de/produkte/jean/\",IF($M$5=\"deutsch\",\"de_DE\",\"en_GB\"),\"/all/a/PR/\",IF(LEFT($E$40,6)=\"R42182\",KETO!D7,KETO!D6),\"/index.xhtml?pk_campaign=battery-protection\"),IF(LEFT($E$40,6)=\"R42182\",KETO!D7,KETO!D6)))","v":"-"},{"$f":"IF($K$17=\"ja/yes\",IF($G40=\"-\",\"-\",HYPERLINK(CONCATENATE(\"http://www.jeanmueller.de/produkte/jean/\",IF($M$5=\"deutsch\",\"de_DE\",\"en_GB\"),\"/all/a/PR/\",KETO!E6,\"/index.xhtml?pk_campaign=battery-protection\"),KETO!E6)),\"-\")","v":"-"},"-","-",{"$f":"IF($G40=\"-\",\"-\",HYPERLINK(CONCATENATE(\"http://www.jeanmueller.de/produkte/jean/\",IF($M$5=\"deutsch\",\"de_DE\",\"en_GB\"),\"/all/a/PR/\",IF(LEFT($E$40,6)=\"R42182\",KETO!H7,KETO!H6),\"/index.xhtml?pk_campaign=battery-protection\"),IF(LEFT($E$40,6)=\"R42182\",KETO!H7,KETO!H6)))","v":"-"},{"$f":"IF($K$17=\"ja/yes\",IF($G40=\"-\",\"-\",HYPERLINK(CONCATENATE(\"http://www.jeanmueller.de/produkte/jean/\",IF($M$5=\"deutsch\",\"de_DE\",\"en_GB\"),\"/all/a/PR/\",KETO!I6,\"/index.xhtml?pk_campaign=battery-protection\"),KETO!I6)),\"-\")","v":"-"},{"$f":"IF($G40=\"-\",\"-\",HYPERLINK(CONCATENATE(\"http://www.jeanmueller.de/produkte/jean/\",IF($M$5=\"deutsch\",\"de_DE\",\"en_GB\"),\"/all/a/PR/\",IF(LEFT($E$40,6)=\"R42182\",KETO!J7,KETO!J6),\"/index.xhtml\"),IF(LEFT($E$40,6)=\"R42182\",KETO!J7,KETO!J6)))","v":"-"}]

{"sheet":"Hilfe","index":1,"n_rows":31,"n_cols":7,"rows_kept":31,"merged":[[1,6,1,10],[2,6,9,10],[10,6,10,10],[11,6,13,10],[14,6,18,10],[21,1,21,10],[22,1,23,10],[24,1,24,10],[25,1,25,10],[26,1,26,10],[27,1,27,10],[28,1,28,10],[29,1,29,10]]}
[]
[{"$nulls":6},"Betriebspunkt (tB/IB)"]
[{"$nulls":6},"Der maximale Betriebsstrom IB ergibt sich aus der USV-Wirkleistung und Entladeschlussspannung: IB = PW/UE.\ntB entspricht dabei der Überbrückungszeit der USV-Anlage. Hierbei ist der ungünstigste Fall des Betriebs unter Wegfall evtl. vorgesehener Redundanzen zu berücksichtigen"]
{"$rows_empty":7}
[{"$nulls":6},"Überlasten (tO/IO)"]
[{"$nulls":6},"Zulässige Überlasten (IO) und ihre Dauer (tO) sind ebenfalls zu berücksichtigen.\n"]
[]
[]
[{"$nulls":6},"Alle Betriebspunkte müssen in ausreichendem Abstand unterhalb Kennlinie liegen.\nHieraus erfolgt die Auswahl des notwendigen Bemessungsstroms der Sicherung."]
{"$rows_empty":7}
[null,"Eingaben der USV- und Batteriedaten erfolgen in den orangen Feldern. Optional können Notizen in den gelben Feldern eingetragen werden."]
[]
["1)","Eingabe Leistungsdaten der USV-Anlage. Die Zwischenkreisspannung ist dabei ausschlaggebend für die Bemesssungspannung der Sicherung. Die Erhaltungsladespannung dagegen ist nicht für das Schaltverhalten der Sicherung relevant. Sie sollte jedoch maximal der Isolationsspannung des verwendeten Schaltgeräts entsprechen.\nFür die Berechnung ist grundsätzlich nur der Wirkungsgrad des Wechselrichters relevant (Von der Batterie zum Verbraucher). Falls nur der Gesamt-Wirkungsgrad AC/AC bekannt ist, liegt die Berechnung aber auf der sicheren Seite."]
["2)","Wenn der Sicherungsfall über eine mech. Sicherungsüberwachung weitergemeldet werden soll, ist hier ja auszuwählen. Dadurch werden automatisch Sicherungseinsätze mit Kraftmelder und das entsprechende Zubehör für die NH-Sicherungslasttrennschalter vorgeschlagen."]
["3)","Eingabe der für die Batterie relevanten Daten. Die Entladeschlussspannung dient zur Berechnung des max. Entladestroms unter Berücksichtigung der angegebenen redundanten Batteriestränge"]
["4)","Falls stattdessen eine manuelle Eingabe des max. Entladestroms gewünscht ist, kann dies hier umgestellt werden."]
["5)","Bis zu zwei Überlasten können zusätzlich in die Berechnung mit einkalkuliert werden. Hier sind Faktor und Dauer anzugeben."]
["6-8)","Nach Eingabe aller relevanten Daten werden in dieser Tabelle die Artikel-Nummern für Sicherungseinsatz (6), NH-Sicherungslasttrennschalter je nach benötigter Polzahl ggf. mit mech. Sicherungsüberwachung (7) und Trennmesser für ungesicherte Pole (8) ausgegeben. Die Artikelnummern verlinken dabei direkt auf unseren Online-Produktkatalog."]
[null,"Zurück"]

{"sheet":"Help","index":2,"n_rows":31,"n_cols":7,"rows_kept":31,"merged":[[1,6,1,10],[2,6,9,10],[10,6,10,10],[11,6,13,10],[14,6,18,10],[21,1,21,10],[22,1,23,10],[24,1,24,10],[25,1,25,10],[26,1,26,10],[27,1,27,10],[28,1,28,10],[29,1,29,10]]}
[]
[{"$nulls":6},"Operating point (tB/IB)"]
[{"$nulls":6},"The maximum operating current IB is calculated from the UPS effective power and the final discharge voltage: IB = PW/UE.\ntB corresponds to the backup time of the UPS system.  Here the operation with outage of potential redundant battery\nstrings has to be considered."]
{"$rows_empty":7}
[{"$nulls":6},"Overload (tO/IO)"]
[{"$nulls":6},"Permissible overload (IO) and their duration (tO) have also to be considered.\n"]
[]
[]
[{"$nulls":6},"All operating points have to be located below the time current characteristics curve with sufficient distance.\nFrom this results the selection of the required rated current for the fuse."]
{"$rows_empty":7}
[null,"Input of UPS and battery data takes place in the orange input fields. Optional notes can be placed in the yellow fields."]
[]
["1)","Input of UPS ratings. The DC link voltage is crucial for the rated voltage of the fuse-link. On the contrary the float voltage is not relevant for the breaking behaviour of the fuse-link. It should not exceed the isolation voltage of the applied switchgear.\nBasically only the efficiency of the inverter (battery to load) is relevant for the calculation. If only the complete efficiency AC/AC is known the calculation will still be on the safe side.\n"]
["2)","If fuse-tripping should be monitored by a mechanical fuse-monitoring you should select yes. Thereby automatically fuse-links with striker indicator and respective accessories for the fuse-switch-disconnectors are recommended."]
["3)","Input of all relevant data for the battery. The final discharge voltage is the base for calculating the max. discharge current while considering the specified redundant battery strings."]
["4)","If the optional manual input of the max. discharge current is required, this can be changed here."]
["5)","Up to two overloads can be considered in the calculation. Here you can input the overload factor and duration."]
["6-8)","After input of all relevant data this table displays the article codes for fuse-link (6), NH fuse-switch-disconnector according to the required no. of poles with mechanical fuse-monitoring if applicable (7) and solid links for non-protected poles (8). The article numbers directly link to our online product catalogue."]
[null,"Back"]

{"sheet":"Übersetzung","index":3,"n_rows":44,"n_cols":2,"rows_kept":44,"hidden":true}
["deutsch","english"]
["Absicherung Batteriestromkreis von USV-Anlagen","Protection of UPS battery circuit"]
["USV-Daten","UPS data"]
["Nennleistung","Rated power"]
["cos phi","Power factor"]
["Zwischenkreisspannung","DC link circuit voltage"]
["Wirkungsgrad DC/AC","Efficiency DC/AC"]
["Sicherung","Fuse"]
["Batterie-Daten","Battery data"]
["Mechanische Sicherungsüberwachung","Mechanical fuse-monitoring"]
["ja","yes"]
["nein","no"]
["Entladeschlussspannung","Final discharge voltage"]
["Überbrückungszeit","Backup time"]
["max. Entladestrom","max. discharge current"]
["Bitte alle orangen Eingabefelder vollständig ausfüllen","Please fill all orange input fields completely"]
["Bestelldaten","Order data"]
["Einfach","Single"]
["Parallel","Parallel"]
["Sicherungseinsatz","Fuse-link"]
["NH-Sicherungslasttrennschalter","NH switch disconnector"]
["Trennmesser","Solid link"]
["1-polig","1-pole"]
["2-polig","2-pole"]
["3-polig","3-pole"]
["4-polig","4-pole"]
["Baugröße","Size"]
["Art.-Nr.","Art.-No."]
["LTL","LTL"]
["mech. SÜ","mech. FM"]
["Projekt-Bezeichnung","Project name"]
["Notizen","Notes"]
["Hilfe","Help"]
["Anzahl Batteriestränge","No. of battery strings"]
["Davon redundant","Of which are redundant"]
["Datum","Date"]
["Manuelle Eingabe","Manual input"]
["Überlast","Overload"]
["Faktor","Factor"]
["Strom","Current"]
["Dauer","Duration"]
["Einkalkulieren","Include"]
["*Achtung! Kein Lastschaltvermögen bei DC-Spannung > 440V. Angaben zur Gebrauchskategorie beachten!","*Attention! No load breaking capability for DC voltages >440V. Consider given utilization category!"]
["*Achtung! Bei Überbrückungszeit >60min Leistungsabgabe beachten. Ggf. Hersteller kontaktieren.","*Attention! For backup time >60min consider power dissipation. Contact manufacturer if necessary."]

{"sheet":"Release Notes","index":4,"n_rows":7,"n_cols":2,"rows_kept":7,"hidden":true}
["Version","Änderungen"]
["2.0","Komplette Überarbeitung mit Integration der neuen Batteriesicherungen 700V und 800V"]
["2.0.1","Fehlerkorrekturen"]
["2.0.2","Ergänzung von Hinweisen zur Leistungsabgabe bei Überbrückungszeiten >60min und zum DC-Lastschaltvermögen"]
["2.0.3","Fehlerkorrektur: Bei kleinen Strömen immer Ausgabe der 35A-Sicherung in Größe NH1"]
["2.0.4","Ergänzung, dass nur Wirkungsgrad des Wechselrichters benötigt wird (DC/AC-Wandlung von Batterie zu Verbraucherseite). Falls AC/AC-Wirkungsgrad eingesetzt ist, liegt die Berechnung aber auf sicherer Seite."]
["2.1.0","Integration von KETO"]

{"sheet":"Berechnung","index":5,"n_rows":21,"n_cols":31,"rows_kept":21,"hidden":true,"merged":[[3,1,3,6],[3,7,3,12],[3,13,3,18],[3,19,3,24],[3,25,3,30],[14,1,14,6],[14,7,14,12],[14,13,14,18],[14,19,14,24],[14,25,14,30]]}
["max. Entladestrom","Überlast 1","Überlast 2"]
[{"$f":"USV!J23","v":{"v":571.4285714285714,"d":"571.43"}},{"$f":"USV!M23","v":0},{"$f":"USV!O23","v":0}]
[]
[null,"NH000",{"$nulls":5},"NH1",{"$nulls":5},"NH2",{"$nulls":5},"NH3",{"$nulls":5},"NH4a"]
[null,"Entladung","Überlast 1","Überlast 2","Max.","Standard","/K","Entladung","Überlast 1","Überlast 2","Max.","Standard","/K","Entladung","Überlast 1","Überlast 2","Max.","Standard","/K","Entladung","Überlast 1","Überlast 2","Max.","Standard","/K","Entladung","Überlast 1","Überlast 2","Max.","Standard","/K"]
["500V",{"$f":"OFFSET('NH00C-500V'!$A$5,0,MATCH(A$2,'NH00C-500V'!$B$24:$O$24,-1))","v":{"$error":"#N/A"}},{"$f":"OFFSET('NH00C-500V'!$A$5,0,MATCH(B$2,'NH00C-500V'!$B$27:$O$27,-1))","v":6},{"$f":"OFFSET('NH00C-500V'!$A$5,0,MATCH(C$2,'NH00C-500V'!$B$30:$O$30,-1))","v":6},{"$f":"MAX(B6:D6)","v":{"$error":"#N/A"}},{"$f":"IF(ISNA(E6),\"-\",VLOOKUP(E6,'SE-500V'!$A:$K,2,0))","v":"-"},{"$f":"IF(ISNA(E6),\"-\",VLOOKUP(E6,'SE-500V'!$A:$K,7,0))","v":"-"},{"$f":"OFFSET('NH1-4a-500V'!$A$5,0,MATCH(A$2,'NH1-4a-500V'!$B$24:$W$24,-1))","v":500},{"$f":"OFFSET('NH1-4a-500V'!$A$5,0,MATCH(B$2,'NH1-4a-500V'!$B$27:$W$27,-1))","v":25},{"$f":"OFFSET('NH1-4a-500V'!$A$5,0,MATCH(C$2,'NH1-4a-500V'!$B$30:$W$30,-1))","v":25},{"$f":"MAX(H6:J6)","v":500},{"$f":"IF(ISNA(K6),\"-\",VLOOKUP(K6,'SE-500V'!$A:$K,3,0))","v":"-"},{"$f":"IF(ISNA(K6),\"-\",VLOOKUP(K6,'SE-500V'!$A:$K,8,0))","v":"-"},{"$f":"OFFSET('NH1-4a-500V'!$A$5,0,MATCH(A$2,'NH1-4a-500V'!$B$24:$V$24,-1))","v":500},{"$f":"OFFSET('NH1-4a-500V'!$A$5,0,MATCH(B$2,'NH1-4a-500V'!$B$27:$V$27,-1))","v":35},{"$f":"OFFSET('NH1-4a-500V'!$A$5,0,MATCH(C$2,'NH1-4a-500V'!$B$30:$V$30,-1))","v":35},{"$f":"MAX(N6:P6)","v":500},{"$f":"IF(ISNA(Q6),\"-\",VLOOKUP(Q6,'SE-500V'!$A:$K,4,0))","v":"-"},{"$f":"IF(ISNA(Q6),\"-\",VLOOKUP(Q6,'SE-500V'!$A:$K,9,0))","v":"-"},{"$f":"OFFSET('NH1-4a-500V'!$A$5,0,MATCH(A$2,'NH1-4a-500V'!$B$24:$V$24,-1))","v":500},{"$f":"OFFSET('NH1-4a-500V'!$A$5,0,MATCH(B$2,'NH1-4a-500V'!$B$27:$V$27,-1))","v":35},{"$f":"OFFSET('NH1-4a-500V'!$A$5,0,MATCH(C$2,'NH1-4a-500V'!$B$30:$V$30,-1))","v":35},{"$f":"MAX(T6:V6)","v":500},{"$f":"IF(ISNA(W6),\"-\",VLOOKUP(W6,'SE-500V'!$A:$K,5,0))","v":"R3216600"},{"$f":"IF(ISNA(W6),\"-\",VLOOKUP(W6,'SE-500V'!$A:$K,10,0))","v":"R3216604"},{"$f":"OFFSET('NH1-4a-500V'!$A$5,0,MATCH(A$2,'NH1-4a-500V'!$B$24:$V$24,-1))","v":500},{"$f":"OFFSET('NH1-4a-500V'!$A$5,0,MATCH(B$2,'NH1-4a-500V'!$B$27:$V$27,-1))","v":35},{"$f":"OFFSET('NH1-4a-500V'!$A$5,0,MATCH(C$2,'NH1-4a-500V'!$B$30:$V$30,-1))","v":35},null,{"$f":"IF(ISNA(Z6),\"-\",VLOOKUP(Z6,'SE-500V'!$A:$K,6,0))","v":"-"},{"$f":"IF(ISNA(Z6),\"-\",VLOOKUP(Z6,'SE-500V'!$A:$K,11,0))","v":"-"}]
["690V",{"$f":"OFFSET('NH00C-690V'!$A$5,0,MATCH(A$2,'NH00C-690V'!$B$24:$M$24,-1))","v":{"$error":"#N/A"}},{"$f":"OFFSET('NH00C-690V'!$A$5,0,MATCH(B$2,'NH00C-690V'!$B$27:$M$27,-1))","v":10},{"$f":"OFFSET('NH00C-690V'!$A$5,0,MATCH(C$2,'NH00C-690V'!$B$30:$M$30,-1))","v":10},{"$f":"MAX(B7:D7)","v":{"$error":"#N/A"}},{"$f":"IF(ISNA(E7),\"-\",VLOOKUP(E7,'SE-690V'!$A:$K,2,0))","v":"-"},{"$f":"IF(ISNA(E7),\"-\",VLOOKUP(E7,'SE-690V'!$A:$K,7,0))","v":"-"},{"$f":"OFFSET('NH1-3-690V'!$A$5,0,MATCH(A$2,'NH1-3-690V'!$B$24:$R$24,-1))","v":500},{"$f":"OFFSET('NH1-3-690V'!$A$5,0,MATCH(B$2,'NH1-3-690V'!$B$27:$R$27,-1))","v":25},{"$f":"OFFSET('NH1-3-690V'!$A$5,0,MATCH(C$2,'NH1-3-690V'!$B$30:$R$30,-1))","v":25},{"$f":"MAX(H7:J7)","v":500},{"$f":"IF(ISNA(K7),\"-\",VLOOKUP(K7,'SE-690V'!$A:$K,3,0))","v":"-"},{"$f":"IF(ISNA(K7),\"-\",VLOOKUP(K7,'SE-690V'!$A:$K,8,0))","v":"-"},{"$f":"OFFSET('NH1-3-690V'!$A$5,0,MATCH(A$2,'NH1-3-690V'!$B$24:$Q$24,-1))","v":500},{"$f":"OFFSET('NH1-3-690V'!$A$5,0,MATCH(B$2,'NH1-3-690V'!$B$27:$Q$27,-1))","v":35},{"$f":"OFFSET('NH1-3-690V'!$A$5,0,MATCH(C$2,'NH1-3-690V'!$B$30:$Q$30,-1))","v":35},{"$f":"MAX(N7:P7)","v":500},{"$f":"IF(ISNA(Q7),\"-\",VLOOKUP(Q7,'SE-690V'!$A:$K,4,0))","v":"-"},{"$f":"IF(ISNA(Q7),\"-\",VLOOKUP(Q7,'SE-690V'!$A:$K,9,0))","v":"-"},{"$f":"OFFSET('NH1-3-690V'!$A$5,0,MATCH(A$2,'NH1-3-690V'!$B$24:$Q$24,-1))","v":500},{"$f":"OFFSET('NH1-3-690V'!$A$5,0,MATCH(B$2,'NH1-3-690V'!$B$27:$Q$27,-1))","v":35},{"$f":"OFFSET('NH1-3-690V'!$A$5,0,MATCH(C$2,'NH1-3-690V'!$B$30:$Q$30,-1))","v":35},{"$f":"MAX(T7:V7)","v":500},{"$f":"IF(ISNA(W7),\"-\",VLOOKUP(W7,'SE-690V'!$A:$K,5,0))","v":"R3286600"},{"$f":"IF(ISNA(W7),\"-\",VLOOKUP(W7,'SE-690V'!$A:$K,10,0))","v":"R3286604"},"-","-","-","-","-","-"]
["700V",{"$f":"OFFSET('NH00C-690V'!$A$5,0,MATCH(A$2,'NH00C-690V'!$B$24:$M$24,-1))","v":{"$error":"#N/A"}},{"$f":"OFFSET('NH00C-690V'!$A$5,0,MATCH(B$2,'NH00C-690V'!$B$27:$M$27,-1))","v":10},{"$f":"OFFSET('NH00C-690V'!$A$5,0,MATCH(C$2,'NH00C-690V'!$B$30:$M$30,-1))","v":10},{"$error":"#N/A"},{"$f":"IF(ISNA(E8),\"-\",VLOOKUP(E8,'SE-DC700V'!$A:$K,2,0))","v":"-"},{"$f":"IF(ISNA(E8),\"-\",VLOOKUP(E8,'SE-DC700V'!$A:$K,7,0))","v":"-"},{"$f":"OFFSET('NH1-3-690V'!$A$5,0,MATCH(A$2,'NH1-3-690V'!$B$24:$R$24,-1))","v":500},{"$f":"OFFSET('NH1-3-690V'!$A$5,0,MATCH(B$2,'NH1-3-690V'!$B$27:$R$27,-1))","v":25},{"$f":"OFFSET('NH1-3-690V'!$A$5,0,MATCH(C$2,'NH1-3-690V'!$B$30:$R$30,-1))","v":25},500,{"$f":"IF(ISNA(K8),\"-\",VLOOKUP(K8,'SE-DC700V'!$A:$K,3,0))","v":"-"},{"$f":"IF(ISNA(K8),\"-\",VLOOKUP(K8,'SE-DC700V'!$A:$K,8,0))","v":"-"},{"$f":"OFFSET('NH1-3-690V'!$A$5,0,MATCH(A$2,'NH1-3-690V'!$B$24:$Q$24,-1))","v":500},{"$f":"OFFSET('NH1-3-690V'!$A$5,0,MATCH(B$2,'NH1-3-690V'!$B$27:$Q$27,-1))","v":35},{"$f":"OFFSET('NH1-3-690V'!$A$5,0,MATCH(C$2,'NH1-3-690V'!$B$30:$Q$30,-1))","v":35},500,{"$f":"IF(ISNA(Q8),\"-\",VLOOKUP(Q8,'SE-DC700V'!$A:$K,4,0))","v":"-"},{"$f":"IF(ISNA(Q8),\"-\",VLOOKUP(Q8,'SE-DC700V'!$A:$K,9,0))","v":"-"},{"$f":"OFFSET('NH1-3-690V'!$A$5,0,MATCH(A$2,'NH1-3-690V'!$B$24:$Q$24,-1))","v":500},{"$f":"OFFSET('NH1-3-690V'!$A$5,0,MATCH(B$2,'NH1-3-690V'!$B$27:$Q$27,-1))","v":35},{"$f":"OFFSET('NH1-3-690V'!$A$5,0,MATCH(C$2,'NH1-3-690V'!$B$30:$Q$30,-1))","v":35},500,{"$f":"IF(ISNA(W8),\"-\",VLOOKUP(W8,'SE-DC700V'!$A:$K,5,0))","v":"R3236602"},{"$f":"IF(ISNA(W8),\"-\",VLOOKUP(W8,'SE-DC700V'!$A:$K,10,0))","v":"R3236603"},"-","-","-","-","-","-"]
["800V",{"$f":"OFFSET('NH00C-690V'!$A$5,0,MATCH(A$2,'NH00C-690V'!$B$24:$M$24,-1))","v":{"$error":"#N/A"}},{"$f":"OFFSET('NH00C-690V'!$A$5,0,MATCH(B$2,'NH00C-690V'!$B$27:$M$27,-1))","v":10},{"$f":"OFFSET('NH00C-690V'!$A$5,0,MATCH(C$2,'NH00C-690V'!$B$30:$M$30,-1))","v":10},{"$error":"#N/A"},{"$f":"IF(ISNA(E9),\"-\",VLOOKUP(E9,'SE-DC800V'!$A:$K,2,0))","v":"-"},{"$f":"IF(ISNA(E9),\"-\",VLOOKUP(E9,'SE-DC800V'!$A:$K,7,0))","v":"-"},{"$f":"OFFSET('NH1-3-690V'!$A$5,0,MATCH(A$2,'NH1-3-690V'!$B$24:$R$24,-1))","v":500},{"$f":"OFFSET('NH1-3-690V'!$A$5,0,MATCH(B$2,'NH1-3-690V'!$B$27:$R$27,-1))","v":25},{"$f":"OFFSET('NH1-3-690V'!$A$5,0,MATCH(C$2,'NH1-3-690V'!$B$30:$R$30,-1))","v":25},500,{"$f":"IF(ISNA(K9),\"-\",VLOOKUP(K9,'SE-DC800V'!$A:$K,3,0))","v":"-"},{"$f":"IF(ISNA(K9),\"-\",VLOOKUP(K9,'SE-DC800V'!$A:$K,8,0))","v":"-"},{"$f":"OFFSET('NH1-3-690V'!$A$5,0,MATCH(A$2,'NH1-3-690V'!$B$24:$Q$24,-1))","v":500},{"$f":"OFFSET('NH1-3-690V'!$A$5,0,MATCH(B$2,'NH1-3-690V'!$B$27:$Q$27,-1))","v":35},{"$f":"OFFSET('NH1-3-690V'!$A$5,0,MATCH(C$2,'NH1-3-690V'!$B$30:$Q$30,-1))","v":35},500,{"$f":"IF(ISNA(Q9),\"-\",VLOOKUP(Q9,'SE-DC800V'!$A:$K,4,0))","v":"-"},{"$f":"IF(ISNA(Q9),\"-\",VLOOKUP(Q9,'SE-DC800V'!$A:$K,9,0))","v":"-"},{"$f":"OFFSET('NH1-3-690V'!$A$5,0,MATCH(A$2,'NH1-3-690V'!$B$24:$Q$24,-1))","v":500},{"$f":"OFFSET('NH1-3-690V'!$A$5,0,MATCH(B$2,'NH1-3-690V'!$B$27:$Q$27,-1))","v":35},{"$f":"OFFSET('NH1-3-690V'!$A$5,0,MATCH(C$2,'NH1-3-690V'!$B$30:$Q$30,-1))","v":35},500,{"$f":"IF(ISNA(W9),\"-\",VLOOKUP(W9,'SE-DC800V'!$A:$K,5,0))","v":"-"},{"$f":"IF(ISNA(W9),\"-\",VLOOKUP(W9,'SE-DC800V'!$A:$K,10,0))","v":"-"},"-","-","-","-","-","-"]
["-","-","-","-","-","-","-","-","-","-","-","-","-","-","-","-","-","-","-","-","-","-","-","-","-","-","-","-","-","-","-"]
[]
[]
["max. Entladestrom 50%","Überlast 1","Überlast 2"]
[{"$f":"A2/2","v":{"v":285.7142857142857,"d":"285.71"}},{"$f":"B2/2","v":{"v":0,"d":"0.00"}},{"v":0,"d":"0.00"}]
[null,"2xNH000",{"$nulls":5},"2xNH1",{"$nulls":5},"2xNH2",{"$nulls":5},"NH3",{"$nulls":5},"NH4a"]
[null,"Entladung","Überlast 1","Überlast 2","Max.","Standard","/K","Entladung","Überlast 1","Überlast 2","Max.","Standard","/K","Entladung","Überlast 1","Überlast 2","Max.","Standard","/K","Entladung","Überlast 1","Überlast 2","Max.","Standard","/K","Entladung","Überlast 1","Überlast 2","Max.","Standard","/K"]
["500V",{"$f":"OFFSET('NH00C-500V'!$A$5,0,MATCH(A$14,'NH00C-500V'!$B$24:$O$24,-1))","v":{"$error":"#N/A"}},{"$f":"OFFSET('NH00C-500V'!$A$5,0,MATCH(B$14,'NH00C-500V'!$B$27:$O$27,-1))","v":6},{"$f":"OFFSET('NH00C-500V'!$A$5,0,MATCH(C$14,'NH00C-500V'!$B$30:$O$30,-1))","v":6},{"$f":"MAX(B17:D17)","v":{"$error":"#N/A"}},{"$f":"IF(ISNA(E17),\"-\",VLOOKUP(E17,'SE-500V'!$A:$K,2,0))","v":"-"},{"$f":"IF(ISNA(E17),\"-\",VLOOKUP(E17,'SE-500V'!$A:$K,7,0))","v":"-"},{"$f":"OFFSET('NH1-4a-500V'!$A$5,0,MATCH(A$14,'NH1-4a-500V'!$B$24:$V$24,-1))","v":315},{"$f":"OFFSET('NH1-4a-500V'!$A$5,0,MATCH(B$14,'NH1-4a-500V'!$B$27:$V$27,-1))","v":35},{"$f":"OFFSET('NH1-4a-500V'!$A$5,0,MATCH(C$14,'NH1-4a-500V'!$B$30:$V$30,-1))","v":35},{"$f":"MAX(H17:J17)","v":315},{"$f":"IF(OR(ISNA(K17),K17<315),\"-\",VLOOKUP(K17,'SE-500V'!$A:$K,3,0))","v":"-"},{"$f":"IF(OR(ISNA(K17),K17<315),\"-\",VLOOKUP(K17,'SE-500V'!$A:$K,8,0))","v":"-"},{"$f":"OFFSET('NH1-4a-500V'!$A$5,0,MATCH(A$14,'NH1-4a-500V'!$B$24:$V$24,-1))","v":315},{"$f":"OFFSET('NH1-4a-500V'!$A$5,0,MATCH(B$14,'NH1-4a-500V'!$B$27:$V$27,-1))","v":35},{"$f":"OFFSET('NH1-4a-500V'!$A$5,0,MATCH(C$14,'NH1-4a-500V'!$B$30:$V$30,-1))","v":35},{"$f":"MAX(N17:P17)","v":315},{"$f":"IF(OR(ISNA(Q17),Q17<315),\"-\",VLOOKUP(Q17,'SE-500V'!$A:$K,4,0))","v":"R2215900"},{"$f":"IF(OR(ISNA(Q17),Q17<315),\"-\",VLOOKUP(Q17,'SE-500V'!$A:$K,9,0))","v":"R2215904"},{"$f":"OFFSET('NH1-4a-500V'!$A$5,0,MATCH(A$14,'NH1-4a-500V'!$B$24:$V$24,-1))","v":315},{"$f":"OFFSET('NH1-4a-500V'!$A$5,0,MATCH(B$14,'NH1-4a-500V'!$B$27:$V$27,-1))","v":35},{"$f":"OFFSET('NH1-4a-500V'!$A$5,0,MATCH(C$14,'NH1-4a-500V'!$B$30:$V$30,-1))","v":35},{"$f":"MAX(T17:V17)","v":315},{"$f":"IF(OR(ISNA(W17),W17<315),\"-\",VLOOKUP(W17,'SE-500V'!$A:$K,5,0))","v":"R3215900"},{"$f":"IF(OR(ISNA(W17),W17<315),\"-\",VLOOKUP(W17,'SE-500V'!$A:$K,10,0))","v":"R3215904"},{"$f":"OFFSET('NH1-4a-500V'!$A$5,0,MATCH(A$14,'NH1-4a-500V'!$B$24:$V$24,-1))","v":315},{"$f":"OFFSET('NH1-4a-500V'!$A$5,0,MATCH(B$14,'NH1-4a-500V'!$B$27:$V$27,-1))","v":35},{"$f":"OFFSET('NH1-4a-500V'!$A$5,0,MATCH(C$14,'NH1-4a-500V'!$B$30:$V$30,-1))","v":35},{"$f":"MAX(Z17:AB17)","v":315},{"$f":"IF(OR(ISNA(AC17),AC17<315),\"-\",VLOOKUP(AC17,'SE-500V'!$A:$K,6,0))","v":"-"},{"$f":"IF(OR(ISNA(AC17),AC17<315),\"-\",VLOOKUP(AC17,'SE-500V'!$A:$K,11,0))","v":"-"}]
["690V",{"$f":"OFFSET('NH00C-690V'!$A$5,0,MATCH(A$14,'NH00C-690V'!$B$24:$M$24,-1))","v":{"$error":"#N/A"}},{"$f":"OFFSET('NH00C-690V'!$A$5,0,MATCH(B$14,'NH00C-690V'!$B$27:$M$27,-1))","v":10},{"$f":"OFFSET('NH00C-690V'!$A$5,0,MATCH(C$14,'NH00C-690V'!$B$30:$M$30,-1))","v":10},{"$f":"MAX(B18:D18)","v":{"$error":"#N/A"}},{"$f":"IF(ISNA(E18),\"-\",VLOOKUP(E18,'SE-690V'!$A:$K,2,0))","v":"-"},{"$f":"IF(ISNA(E18),\"-\",VLOOKUP(E18,'SE-690V'!$A:$K,7,0))","v":"-"},{"$f":"OFFSET('NH1-3-690V'!$A$5,0,MATCH(A$14,'NH1-3-690V'!$B$24:$R$24,-1))","v":250},{"$f":"OFFSET('NH1-3-690V'!$A$5,0,MATCH(B$14,'NH1-3-690V'!$B$27:$R$27,-1))","v":25},{"$f":"OFFSET('NH1-3-690V'!$A$5,0,MATCH(C$14,'NH1-3-690V'!$B$30:$R$30,-1))","v":25},{"$f":"MAX(H18:J18)","v":250},{"$f":"IF(OR(ISNA(K18),K18<315),\"-\",VLOOKUP(K18,'SE-690V'!$A:$K,3,0))","v":"-"},{"$f":"IF(OR(ISNA(K18),K18<315),\"-\",VLOOKUP(K18,'SE-690V'!$A:$K,8,0))","v":"-"},{"$f":"OFFSET('NH1-3-690V'!$A$5,0,MATCH(A$14,'NH1-3-690V'!$B$24:$Q$24,-1))","v":250},{"$f":"OFFSET('NH1-3-690V'!$A$5,0,MATCH(B$14,'NH1-3-690V'!$B$27:$Q$27,-1))","v":35},{"$f":"OFFSET('NH1-3-690V'!$A$5,0,MATCH(C$14,'NH1-3-690V'!$B$30:$Q$30,-1))","v":35},{"$f":"MAX(N18:P18)","v":250},{"$f":"IF(OR(ISNA(Q18),Q18<315),\"-\",VLOOKUP(Q18,'SE-690V'!$A:$K,4,0))","v":"-"},{"$f":"IF(OR(ISNA(Q18),Q18<315),\"-\",VLOOKUP(Q18,'SE-690V'!$A:$K,9,0))","v":"-"},{"$f":"OFFSET('NH1-3-690V'!$A$5,0,MATCH(A$14,'NH1-3-690V'!$B$24:$Q$24,-1))","v":250},{"$f":"OFFSET('NH1-3-690V'!$A$5,0,MATCH(B$14,'NH1-3-690V'!$B$27:$Q$27,-1))","v":35},{"$f":"OFFSET('NH1-3-690V'!$A$5,0,MATCH(C$14,'NH1-3-690V'!$B$30:$Q$30,-1))","v":35},{"$f":"MAX(T18:V18)","v":250},{"$f":"IF(OR(ISNA(W18),W18<315),\"-\",VLOOKUP(W18,'SE-690V'!$A:$K,5,0))","v":"-"},{"$f":"IF(OR(ISNA(W18),W18<315),\"-\",VLOOKUP(W18,'SE-690V'!$A:$K,10,0))","v":"-"},"-","-","-","-","-","-"]
["700V",{"$f":"OFFSET('NH00C-690V'!$A$5,0,MATCH(A$14,'NH00C-690V'!$B$24:$M$24,-1))","v":{"$error":"#N/A"}},{"$f":"OFFSET('NH00C-690V'!$A$5,0,MATCH(B$14,'NH00C-690V'!$B$27:$M$27,-1))","v":10},{"$f":"OFFSET('NH00C-690V'!$A$5,0,MATCH(C$14,'NH00C-690V'!$B$30:$M$30,-1))","v":10},{"$error":"#N/A"},{"$f":"IF(ISNA(E19),\"-\",VLOOKUP(E19,'SE-DC700V'!$A:$K,2,0))","v":"-"},{"$f":"IF(ISNA(E19),\"-\",VLOOKUP(E19,'SE-DC700V'!$A:$K,7,0))","v":"-"},{"$f":"OFFSET('NH1-3-690V'!$A$5,0,MATCH(A$14,'NH1-3-690V'!$B$24:$R$24,-1))","v":250},{"$f":"OFFSET('NH1-3-690V'!$A$5,0,MATCH(B$14,'NH1-3-690V'!$B$27:$R$27,-1))","v":25},{"$f":"OFFSET('NH1-3-690V'!$A$5,0,MATCH(C$14,'NH1-3-690V'!$B$30:$R$30,-1))","v":25},250,{"$f":"IF(OR(ISNA(K19),K19<315),\"-\",VLOOKUP(K19,'SE-DC700V'!$A:$K,3,0))","v":"-"},{"$f":"IF(OR(ISNA(K19),K19<315),\"-\",VLOOKUP(K19,'SE-DC700V'!$A:$K,8,0))","v":"-"},{"$f":"OFFSET('NH1-3-690V'!$A$5,0,MATCH(A$14,'NH1-3-690V'!$B$24:$Q$24,-1))","v":250},{"$f":"OFFSET('NH1-3-690V'!$A$5,0,MATCH(B$14,'NH1-3-690V'!$B$27:$Q$27,-1))","v":35},{"$f":"OFFSET('NH1-3-690V'!$A$5,0,MATCH(C$14,'NH1-3-690V'!$B$30:$Q$30,-1))","v":35},250,{"$f":"IF(OR(ISNA(Q19),Q19<315),\"-\",VLOOKUP(Q19,'SE-DC700V'!$A:$K,4,0))","v":"-"},{"$f":"IF(OR(ISNA(Q19),Q19<315),\"-\",VLOOKUP(Q19,'SE-DC700V'!$A:$K,9,0))","v":"-"},{"$f":"OFFSET('NH1-3-690V'!$A$5,0,MATCH(A$14,'NH1-3-690V'!$B$24:$Q$24,-1))","v":250},{"$f":"OFFSET('NH1-3-690V'!$A$5,0,MATCH(B$14,'NH1-3-690V'!$B$27:$Q$27,-1))","v":35},{"$f":"OFFSET('NH1-3-690V'!$A$5,0,MATCH(C$14,'NH1-3-690V'!$B$30:$Q$30,-1))","v":35},250,{"$f":"IF(OR(ISNA(W19),W19<315),\"-\",VLOOKUP(W19,'SE-DC700V'!$A:$K,5,0))","v":"-"},{"$f":"IF(OR(ISNA(W19),W19<315),\"-\",VLOOKUP(W19,'SE-DC700V'!$A:$K,10,0))","v":"-"},"-","-","-","-","-","-"]
["800V",{"$f":"OFFSET('NH00C-690V'!$A$5,0,MATCH(A$14,'NH00C-690V'!$B$24:$M$24,-1))","v":{"$error":"#N/A"}},{"$f":"OFFSET('NH00C-690V'!$A$5,0,MATCH(B$14,'NH00C-690V'!$B$27:$M$27,-1))","v":10},{"$f":"OFFSET('NH00C-690V'!$A$5,0,MATCH(C$14,'NH00C-690V'!$B$30:$M$30,-1))","v":10},{"$error":"#N/A"},{"$f":"IF(ISNA(E20),\"-\",VLOOKUP(E20,'SE-DC800V'!$A:$K,2,0))","v":"-"},{"$f":"IF(ISNA(E20),\"-\",VLOOKUP(E20,'SE-DC800V'!$A:$K,7,0))","v":"-"},{"$f":"OFFSET('NH1-3-690V'!$A$5,0,MATCH(A$14,'NH1-3-690V'!$B$24:$R$24,-1))","v":250},{"$f":"OFFSET('NH1-3-690V'!$A$5,0,MATCH(B$14,'NH1-3-690V'!$B$27:$R$27,-1))","v":25},{"$f":"OFFSET('NH1-3-690V'!$A$5,0,MATCH(C$14,'NH1-3-690V'!$B$30:$R$30,-1))","v":25},250,{"$f":"IF(OR(ISNA(K20),K20<315),\"-\",VLOOKUP(K20,'SE-DC800V'!$A:$K,3,0))","v":"-"},{"$f":"IF(OR(ISNA(K20),K20<315),\"-\",VLOOKUP(K20,'SE-DC800V'!$A:$K,8,0))","v":"-"},{"$f":"OFFSET('NH1-3-690V'!$A$5,0,MATCH(A$14,'NH1-3-690V'!$B$24:$Q$24,-1))","v":250},{"$f":"OFFSET('NH1-3-690V'!$A$5,0,MATCH(B$14,'NH1-3-690V'!$B$27:$Q$27,-1))","v":35},{"$f":"OFFSET('NH1-3-690V'!$A$5,0,MATCH(C$14,'NH1-3-690V'!$B$30:$Q$30,-1))","v":35},250,{"$f":"IF(OR(ISNA(Q20),Q20<315),\"-\",VLOOKUP(Q20,'SE-DC800V'!$A:$K,4,0))","v":"-"},{"$f":"IF(OR(ISNA(Q20),Q20<315),\"-\",VLOOKUP(Q20,'SE-DC800V'!$A:$K,9,0))","v":"-"},{"$f":"OFFSET('NH1-3-690V'!$A$5,0,MATCH(A$14,'NH1-3-690V'!$B$24:$Q$24,-1))","v":250},{"$f":"OFFSET('NH1-3-690V'!$A$5,0,MATCH(B$14,'NH1-3-690V'!$B$27:$Q$27,-1))","v":35},{"$f":"OFFSET('NH1-3-690V'!$A$5,0,MATCH(C$14,'NH1-3-690V'!$B$30:$Q$30,-1))","v":35},250,{"$f":"IF(OR(ISNA(W20),W20<315),\"-\",VLOOKUP(W20,'SE-DC800V'!$A:$K,5,0))","v":"-"},{"$f":"IF(OR(ISNA(W20),W20<315),\"-\",VLOOKUP(W20,'SE-DC800V'!$A:$K,10,0))","v":"-"},"-","-","-","-","-","-"]
["-","-","-","-","-","-","-","-","-","-","-","-","-","-","-","-","-","-","-","-","-","-","-","-","-","-","-","-","-","-","-"]

{"sheet":"NH00C-500V","index":6,"n_rows":30,"n_cols":15,"rows_kept":30,"hidden":true}
[]
[]
["NH00C/500V-uf2"]
[]
["(s)",160,125,100,80,63,50,40,35,32,25,20,16,10,6]
[10,355,300,235,190,135,115,105,86,73,42,33,26,23.5,22]
[60,255,220,175,130,107,83,75,62.5,53,36,30,23,22,21]
[120,230,200,155,121,96,75,68,56,50,34.5,29,22.5,21.5,20]
[180,223,190,145,119,92,71,63,53,46,34,28,22,21,19.5]
[240,220,180,140,118,90,69,62,52,44,33.5,27.5,22,20.5,19]
[300,217,175,138,115,87,67,61,51,43,33,27,22,20,18]
[600,208,160,130,110,82,63,57,47.5,41.5,32,25.5,21.5,19.5,17]
[900,202,155,129,108,80,62,55,46.5,41,32,25,21.5,19,17]
[1200,200,152,128,105,79,61.5,55,45,40,32,25,21.5,18.5,17]
[1800,199,150,126,102,77,61,53.5,44.5,39.5,32,24.5,21,18.5,17]
[2400,197,150,126,100,77,60,53.5,44,39,32,24.5,21,18.5,16.5]
[3000,195,149,125,100,76,60,53,44,39,31.5,24,21,18.5,16.5]
[3600,193,148,125,100,75,60,53,43.5,38,31.5,24,21,18,16.5]
[5400,190,145,123,97,74,58,52.5,43,37.5,31.5,24,21,18,16]
[7200,188,144,122,96,74,58,52,43,37,31,24,20,17.5,16]
[9000,185,143,121,96,73,58,52,42.5,36.5,30.5,23.5,20,17.5,15.5]
[]
[{"$f":"USV!J22*60","v":900},{"$f":"(OFFSET(B$5,IF($A23>$A$21,0,$A24),0)+OFFSET(B$5,IF($A23>$A$21,0,$A24+1),0))/2","v":{"v":201,"d":"201.00"}},{"$f":"(OFFSET(C$5,IF($A23>$A$21,0,$A24),0)+OFFSET(C$5,IF($A23>$A$21,0,$A24+1),0))/2","v":{"v":153.5,"d":"153.50"}},{"v":128.5,"d":"128.50"},{"v":106.5,"d":"106.50"},{"v":79.5,"d":"79.50"},61.75,{"v":55,"d":"55.00"},45.75,{"v":40.5,"d":"40.50"},{"v":32,"d":"32.00"},{"v":25,"d":"25.00"},{"v":21.5,"d":"21.50"},18.75,{"v":17,"d":"17.00"}]
[{"$f":"MATCH($A23,$A$6:A21,1)","v":8},{"$f":"B23*IF($A23>$A$21,1,0.85)","v":170.85},{"$f":"C23*IF($A23>$A$21,1,0.85)","v":{"v":130.475,"d":"130.48"}},{"v":109.225,"d":"109.23"},{"v":90.52499999999999,"d":"90.53"},{"v":67.575,"d":"67.58"},{"v":52.4875,"d":"52.49"},46.75,{"v":38.887499999999996,"d":"38.89"},{"v":34.425,"d":"34.43"},{"v":27.2,"d":"27.20"},21.25,{"v":18.275,"d":"18.28"},{"v":15.9375,"d":"15.94"},14.45]
[]
[{"$f":"USV!M24*60","v":600},{"$f":"(OFFSET(B$5,IF($A26>$A$21,0,$A27),0)+OFFSET(B$5,IF($A26>$A$21,0,$A27+1),0))/2","v":{"v":205,"d":"205.00"}},{"$f":"(OFFSET(C$5,IF($A26>$A$21,0,$A27),0)+OFFSET(C$5,IF($A26>$A$21,0,$A27+1),0))/2","v":{"v":157.5,"d":"157.50"}},{"$f":"(OFFSET(D$5,IF($A26>$A$21,0,$A27),0)+OFFSET(D$5,IF($A26>$A$21,0,$A27+1),0))/2","v":{"v":129.5,"d":"129.50"}},{"$f":"(OFFSET(E$5,IF($A26>$A$21,0,$A27),0)+OFFSET(E$5,IF($A26>$A$21,0,$A27+1),0))/2","v":{"v":109,"d":"109.00"}},{"$f":"(OFFSET(F$5,IF($A26>$A$21,0,$A27),0)+OFFSET(F$5,IF($A26>$A$21,0,$A27+1),0))/2","v":{"v":81,"d":"81.00"}},{"$f":"(OFFSET(G$5,IF($A26>$A$21,0,$A27),0)+OFFSET(G$5,IF($A26>$A$21,0,$A27+1),0))/2","v":{"v":62.5,"d":"62.50"}},{"$f":"(OFFSET(H$5,IF($A26>$A$21,0,$A27),0)+OFFSET(H$5,IF($A26>$A$21,0,$A27+1),0))/2","v":{"v":56,"d":"56.00"}},{"$f":"(OFFSET(I$5,IF($A26>$A$21,0,$A27),0)+OFFSET(I$5,IF($A26>$A$21,0,$A27+1),0))/2","v":{"v":47,"d":"47.00"}},{"$f":"(OFFSET(J$5,IF($A26>$A$21,0,$A27),0)+OFFSET(J$5,IF($A26>$A$21,0,$A27+1),0))/2","v":41.25},{"$f":"(OFFSET(K$5,IF($A26>$A$21,0,$A27),0)+OFFSET(K$5,IF($A26>$A$21,0,$A27+1),0))/2","v":{"v":32,"d":"32.00"}},{"$f":"(OFFSET(L$5,IF($A26>$A$21,0,$A27),0)+OFFSET(L$5,IF($A26>$A$21,0,$A27+1),0))/2","v":25.25},{"$f":"(OFFSET(M$5,IF($A26>$A$21,0,$A27),0)+OFFSET(M$5,IF($A26>$A$21,0,$A27+1),0))/2","v":{"v":21.5,"d":"21.50"}},{"$f":"(OFFSET(N$5,IF($A26>$A$21,0,$A27),0)+OFFSET(N$5,IF($A26>$A$21,0,$A27+1),0))/2","v":19.25},{"$f":"(OFFSET(O$5,IF($A26>$A$21,0,$A27),0)+OFFSET(O$5,IF($A26>$A$21,0,$A27+1),0))/2","v":{"v":17,"d":"17.00"}}]
[{"$f":"MATCH($A26,$A$6:A24,1)","v":7},{"$f":"B26*IF($A26>$A$21,1,0.85)","v":174.25},{"$f":"C26*IF($A26>$A$21,1,0.85)","v":{"v":133.875,"d":"133.88"}},{"$f":"D26*IF($A26>$A$21,1,0.85)","v":{"v":110.075,"d":"110.08"}},{"$f":"E26*IF($A26>$A$21,1,0.85)","v":{"v":92.64999999999999,"d":"92.65"}},{"$f":"F26*IF($A26>$A$21,1,0.85)","v":68.85},{"$f":"G26*IF($A26>$A$21,1,0.85)","v":{"v":53.125,"d":"53.13"}},{"$f":"H26*IF($A26>$A$21,1,0.85)","v":{"v":47.6,"d":"47.60"}},{"$f":"I26*IF($A26>$A$21,1,0.85)","v":{"v":39.949999999999996,"d":"39.95"}},{"$f":"J26*IF($A26>$A$21,1,0.85)","v":{"v":35.0625,"d":"35.06"}},{"$f":"K26*IF($A26>$A$21,1,0.85)","v":{"v":27.2,"d":"27.20"}},{"$f":"L26*IF($A26>$A$21,1,0.85)","v":{"v":21.4625,"d":"21.46"}},{"$f":"M26*IF($A26>$A$21,1,0.85)","v":{"v":18.275,"d":"18.28"}},{"$f":"N26*IF($A26>$A$21,1,0.85)","v":{"v":16.3625,"d":"16.36"}},{"$f":"O26*IF($A26>$A$21,1,0.85)","v":14.45}]
[]
[{"$f":"USV!O24*60","v":60},{"$f":"(OFFSET(B$5,IF($A29>$A$21,0,$A30),0)+OFFSET(B$5,IF($A29>$A$21,0,$A30+1),0))/2","v":{"v":242.5,"d":"242.50"}},{"$f":"(OFFSET(C$5,IF($A29>$A$21,0,$A30),0)+OFFSET(C$5,IF($A29>$A$21,0,$A30+1),0))/2","v":{"v":210,"d":"210.00"}},{"$f":"(OFFSET(D$5,IF($A29>$A$21,0,$A30),0)+OFFSET(D$5,IF($A29>$A$21,0,$A30+1),0))/2","v":{"v":165,"d":"165.00"}},{"$f":"(OFFSET(E$5,IF($A29>$A$21,0,$A30),0)+OFFSET(E$5,IF($A29>$A$21,0,$A30+1),0))/2","v":{"v":125.5,"d":"125.50"}},{"$f":"(OFFSET(F$5,IF($A29>$A$21,0,$A30),0)+OFFSET(F$5,IF($A29>$A$21,0,$A30+1),0))/2","v":{"v":101.5,"d":"101.50"}},{"$f":"(OFFSET(G$5,IF($A29>$A$21,0,$A30),0)+OFFSET(G$5,IF($A29>$A$21,0,$A30+1),0))/2","v":{"v":79,"d":"79.00"}},{"$f":"(OFFSET(H$5,IF($A29>$A$21,0,$A30),0)+OFFSET(H$5,IF($A29>$A$21,0,$A30+1),0))/2","v":{"v":71.5,"d":"71.50"}},{"$f":"(OFFSET(I$5,IF($A29>$A$21,0,$A30),0)+OFFSET(I$5,IF($A29>$A$21,0,$A30+1),0))/2","v":59.25},{"$f":"(OFFSET(J$5,IF($A29>$A$21,0,$A30),0)+OFFSET(J$5,IF($A29>$A$21,0,$A30+1),0))/2","v":{"v":51.5,"d":"51.50"}},{"$f":"(OFFSET(K$5,IF($A29>$A$21,0,$A30),0)+OFFSET(K$5,IF($A29>$A$21,0,$A30+1),0))/2","v":35.25},{"$f":"(OFFSET(L$5,IF($A29>$A$21,0,$A30),0)+OFFSET(L$5,IF($A29>$A$21,0,$A30+1),0))/2","v":{"v":29.5,"d":"29.50"}},{"$f":"(OFFSET(M$5,IF($A29>$A$21,0,$A30),0)+OFFSET(M$5,IF($A29>$A$21,0,$A30+1),0))/2","v":22.75},{"$f":"(OFFSET(N$5,IF($A29>$A$21,0,$A30),0)+OFFSET(N$5,IF($A29>$A$21,0,$A30+1),0))/2","v":21.75},{"$f":"(OFFSET(O$5,IF($A29>$A$21,0,$A30),0)+OFFSET(O$5,IF($A29>$A$21,0,$A30+1),0))/2","v":{"v":20.5,"d":"20.50"}}]
[{"$f":"MATCH($A29,$A$6:A27,1)","v":2},{"$f":"B29*IF($A29>$A$21,1,0.85)","v":{"v":206.125,"d":"206.13"}},{"$f":"C29*IF($A29>$A$21,1,0.85)","v":{"v":178.5,"d":"178.50"}},{"$f":"D29*IF($A29>$A$21,1,0.85)","v":140.25},{"$f":"E29*IF($A29>$A$21,1,0.85)","v":{"v":106.675,"d":"106.68"}},{"$f":"F29*IF($A29>$A$21,1,0.85)","v":{"v":86.27499999999999,"d":"86.28"}},{"$f":"G29*IF($A29>$A$21,1,0.85)","v":{"v":67.14999999999999,"d":"67.15"}},{"$f":"H29*IF($A29>$A$21,1,0.85)","v":{"v":60.775,"d":"60.78"}},{"$f":"I29*IF($A29>$A$21,1,0.85)","v":{"v":50.3625,"d":"50.36"}},{"$f":"J29*IF($A29>$A$21,1,0.85)","v":{"v":43.775,"d":"43.78"}},{"$f":"K29*IF($A29>$A$21,1,0.85)","v":{"v":29.9625,"d":"29.96"}},{"$f":"L29*IF($A29>$A$21,1,0.85)","v":{"v":25.075,"d":"25.08"}},{"$f":"M29*IF($A29>$A$21,1,0.85)","v":{"v":19.3375,"d":"19.34"}},{"$f":"N29*IF($A29>$A$21,1,0.85)","v":{"v":18.4875,"d":"18.49"}},{"$f":"O29*IF($A29>$A$21,1,0.85)","v":{"v":17.425,"d":"17.43"}}]

{"sheet":"NH1-4a-500V","index":7,"n_rows":30,"n_cols":23,"rows_kept":30,"hidden":true}
[]
[]
["NH1-3/500V-uf2"]
[{"$nulls":22},"NH000"]
["(s)",1500,1250,1000,800,630,500,425,400,350,315,250,224,200,160,125,100,80,63,50,40,35,25]
[10,4371,3491,2788,2227,1600,1220,1050,1000,820,710,610,520,430,340,290,230,175,133,115,96,82.5,42]
[60,3191,2548,2035,1625,1190,925,800,720,615,525,435,380,320,250,215,165,128,105,82,71,62,36]
[120,2852,2277,1819,1452,1100,840,720,660,550,480,410,340,300,230,200,151,121,95,74.5,64.5,55,34.5]
[180,2666,2129,1700,1358,1050,800,690,625,525,445,380,325,280,222,185,141,118,90,72,62,52.5,34]
[240,2548,2035,1625,1298,1000,775,670,617,517,437,365,321,270,220,178,140,117,88,70,61,52,33.5]
[300,2436,1946,1554,1241,960,750,650,600,505,430,355,317,260,217,171,135,115,85,68,59,51.5,33]
[600,2227,1778,1420,1134,900,720,620,570,470,415,335,305,241,203,160,130,109,81.5,63.5,55,48,32]
[900,2129,1700,1358,1084,860,700,610,545,450,405,330,298,239,200,154,129,107,80,62,53.5,46,32]
[1200,2081,1662,1328,1060,850,690,600,540,445,400,325,290,235,200,153,129,105,77.5,61.5,53,45,32]
[1800,1990,1589,1269,1014,830,660,580,527,435,387,323,277,232,197,152,128,102,75.5,60.5,52,44,32]
[2400,1946,1554,1241,991,820,650,575,525,433,385,321,275,230,195,151,127,100,75,60,52,44,32]
[3000,1902,1519,1213,969,810,640,570,524,431,380,320,272,230,191,147,125,100,75,60,52,43.5,31.5]
[3600,1885,1506,1202,960,800,631,570,522,430,377,320,270,229,190,146,125,97,75,60,52,43.5,31.5]
[5400,1860,1486,1186,947,775,627,560,520,428,371,319,268,227,187,145,124,96,74,60,51,43,31.5]
[7200,1835,1466,1170,935,760,620,555,518,427,370,318,265,225,185,143,123,95,73.5,59,51,43,31]
[9000,1819,1452,1160,926,750,615,550,515,425,365,315,265,225,185,140,120,94,73,58,50,42.5,30.5]
[]
[{"$f":"USV!J22*60","v":900},{"$f":"(OFFSET(B$5,IF($A23>$A$21,0,$A24),0)+OFFSET(B5,IF($A23>$A$21,0,$A24+1),0))/2","v":{"v":2105,"d":"2105.00"}},{"$f":"(OFFSET(C$5,IF($A23>$A$21,0,$A24),0)+OFFSET(C5,IF($A23>$A$21,0,$A24+1),0))/2","v":{"v":1681,"d":"1681.00"}},{"v":1343,"d":"1343.00"},{"v":1072,"d":"1072.00"},{"v":855,"d":"855.00"},{"v":695,"d":"695.00"},{"v":605,"d":"605.00"},{"v":542.5,"d":"542.50"},{"v":447.5,"d":"447.50"},{"v":402.5,"d":"402.50"},{"v":327.5,"d":"327.50"},{"v":294,"d":"294.00"},{"v":237,"d":"237.00"},{"v":200,"d":"200.00"},{"v":153.5,"d":"153.50"},{"v":129,"d":"129.00"},{"v":106,"d":"106.00"},78.75,61.75,53.25,{"v":45.5,"d":"45.50"},{"$f":"(OFFSET(W$5,IF($A23>$A$21,0,$A24),0)+OFFSET(W5,IF($A23>$A$21,0,$A24+1),0))/2","v":{"v":32,"d":"32.00"}}]
[{"$f":"MATCH($A23,$A$6:$A$21,1)","v":8},{"$f":"B23*IF($A23>$A$21,1,0.85)","v":1789.25},{"$f":"C23*IF($A23>$A$21,1,0.85)","v":1428.85},1141.55,{"v":911.1999999999999,"d":"911.20"},726.75,590.75,514.25,{"v":461.125,"d":"461.13"},{"v":380.375,"d":"380.38"},{"v":342.125,"d":"342.13"},{"v":278.375,"d":"278.38"},{"v":249.9,"d":"249.90"},201.45,{"v":170,"d":"170.00"},{"v":130.475,"d":"130.48"},{"v":109.64999999999999,"d":"109.65"},{"v":90.1,"d":"90.10"},{"v":66.9375,"d":"66.94"},{"v":52.4875,"d":"52.49"},{"v":45.262499999999996,"d":"45.26"},{"v":38.675,"d":"38.68"},{"$f":"W23*IF($A23>$A$21,1,0.85)","v":{"v":27.2,"d":"27.20"}}]
[]
[{"$f":"USV!M24*60","v":600},{"$f":"(OFFSET(B$5,IF($A26>$A$21,0,$A27),0)+OFFSET(B8,IF($A26>$A$21,0,$A27+1),0))/2","v":{"v":2086.5,"d":"2086.50"}},{"$f":"(OFFSET(C$5,IF($A26>$A$21,0,$A27),0)+OFFSET(C8,IF($A26>$A$21,0,$A27+1),0))/2","v":{"v":1666,"d":"1666.00"}},{"$f":"(OFFSET(D$5,IF($A26>$A$21,0,$A27),0)+OFFSET(D8,IF($A26>$A$21,0,$A27+1),0))/2","v":{"v":1330.5,"d":"1330.50"}},{"$f":"(OFFSET(E$5,IF($A26>$A$21,0,$A27),0)+OFFSET(E8,IF($A26>$A$21,0,$A27+1),0))/2","v":{"v":1062.5,"d":"1062.50"}},{"$f":"(OFFSET(F$5,IF($A26>$A$21,0,$A27),0)+OFFSET(F8,IF($A26>$A$21,0,$A27+1),0))/2","v":{"v":860,"d":"860.00"}},{"$f":"(OFFSET(G$5,IF($A26>$A$21,0,$A27),0)+OFFSET(G8,IF($A26>$A$21,0,$A27+1),0))/2","v":{"v":685,"d":"685.00"}},{"$f":"(OFFSET(H$5,IF($A26>$A$21,0,$A27),0)+OFFSET(H8,IF($A26>$A$21,0,$A27+1),0))/2","v":{"v":597.5,"d":"597.50"}},{"$f":"(OFFSET(I$5,IF($A26>$A$21,0,$A27),0)+OFFSET(I8,IF($A26>$A$21,0,$A27+1),0))/2","v":{"v":547.5,"d":"547.50"}},{"$f":"(OFFSET(J$5,IF($A26>$A$21,0,$A27),0)+OFFSET(J8,IF($A26>$A$21,0,$A27+1),0))/2","v":{"v":451.5,"d":"451.50"}},{"$f":"(OFFSET(K$5,IF($A26>$A$21,0,$A27),0)+OFFSET(K8,IF($A26>$A$21,0,$A27+1),0))/2","v":{"v":400,"d":"400.00"}},{"$f":"(OFFSET(L$5,IF($A26>$A$21,0,$A27),0)+OFFSET(L8,IF($A26>$A$21,0,$A27+1),0))/2","v":{"v":328,"d":"328.00"}},{"$f":"(OFFSET(M$5,IF($A26>$A$21,0,$A27),0)+OFFSET(M8,IF($A26>$A$21,0,$A27+1),0))/2","v":{"v":290,"d":"290.00"}},{"$f":"(OFFSET(N$5,IF($A26>$A$21,0,$A27),0)+OFFSET(N8,IF($A26>$A$21,0,$A27+1),0))/2","v":{"v":235.5,"d":"235.50"}},{"$f":"(OFFSET(O$5,IF($A26>$A$21,0,$A27),0)+OFFSET(O8,IF($A26>$A$21,0,$A27+1),0))/2","v":{"v":199,"d":"199.00"}},{"$f":"(OFFSET(P$5,IF($A26>$A$21,0,$A27),0)+OFFSET(P8,IF($A26>$A$21,0,$A27+1),0))/2","v":{"v":155.5,"d":"155.50"}},{"$f":"(OFFSET(Q$5,IF($A26>$A$21,0,$A27),0)+OFFSET(Q8,IF($A26>$A$21,0,$A27+1),0))/2","v":{"v":128.5,"d":"128.50"}},{"$f":"(OFFSET(R$5,IF($A26>$A$21,0,$A27),0)+OFFSET(R8,IF($A26>$A$21,0,$A27+1),0))/2","v":{"v":104.5,"d":"104.50"}},{"$f":"(OFFSET(S$5,IF($A26>$A$21,0,$A27),0)+OFFSET(S8,IF($A26>$A$21,0,$A27+1),0))/2","v":78.25},{"$f":"(OFFSET(T$5,IF($A26>$A$21,0,$A27),0)+OFFSET(T8,IF($A26>$A$21,0,$A27+1),0))/2","v":61.75},{"$f":"(OFFSET(U$5,IF($A26>$A$21,0,$A27),0)+OFFSET(U8,IF($A26>$A$21,0,$A27+1),0))/2","v":{"v":53.5,"d":"53.50"}},{"$f":"(OFFSET(V$5,IF($A26>$A$21,0,$A27),0)+OFFSET(V8,IF($A26>$A$21,0,$A27+1),0))/2","v":{"v":46,"d":"46.00"}},{"v":32,"d":"32.00"}]
[{"$f":"MATCH($A26,$A$6:$A$21,1)","v":7},{"$f":"B26*IF($A26>$A$21,1,0.85)","v":{"v":1773.5249999999999,"d":"1773.53"}},{"$f":"C26*IF($A26>$A$21,1,0.85)","v":{"v":1416.1,"d":"1416.10"}},{"$f":"D26*IF($A26>$A$21,1,0.85)","v":{"v":1130.925,"d":"1130.93"}},{"$f":"E26*IF($A26>$A$21,1,0.85)","v":{"v":903.125,"d":"903.13"}},{"$f":"F26*IF($A26>$A$21,1,0.85)","v":{"v":731,"d":"731.00"}},{"$f":"G26*IF($A26>$A$21,1,0.85)","v":582.25},{"$f":"H26*IF($A26>$A$21,1,0.85)","v":{"v":507.875,"d":"507.88"}},{"$f":"I26*IF($A26>$A$21,1,0.85)","v":{"v":465.375,"d":"465.38"}},{"$f":"J26*IF($A26>$A$21,1,0.85)","v":{"v":383.775,"d":"383.78"}},{"$f":"K26*IF($A26>$A$21,1,0.85)","v":{"v":340,"d":"340.00"}},{"$f":"L26*IF($A26>$A$21,1,0.85)","v":{"v":278.8,"d":"278.80"}},{"$f":"M26*IF($A26>$A$21,1,0.85)","v":{"v":246.5,"d":"246.50"}},{"$f":"N26*IF($A26>$A$21,1,0.85)","v":{"v":200.17499999999998,"d":"200.18"}},{"$f":"O26*IF($A26>$A$21,1,0.85)","v":169.15},{"$f":"P26*IF($A26>$A$21,1,0.85)","v":{"v":132.17499999999998,"d":"132.18"}},{"$f":"Q26*IF($A26>$A$21,1,0.85)","v":{"v":109.225,"d":"109.23"}},{"$f":"R26*IF($A26>$A$21,1,0.85)","v":{"v":88.825,"d":"88.83"}},{"$f":"S26*IF($A26>$A$21,1,0.85)","v":{"v":66.5125,"d":"66.51"}},{"$f":"T26*IF($A26>$A$21,1,0.85)","v":{"v":52.4875,"d":"52.49"}},{"$f":"U26*IF($A26>$A$21,1,0.85)","v":{"v":45.475,"d":"45.48"}},{"$f":"V26*IF($A26>$A$21,1,0.85)","v":{"v":39.1,"d":"39.10"}},{"v":27.2,"d":"27.20"}]
[]
[{"$f":"USV!O24*60","v":60},{"$f":"(OFFSET(B$5,IF($A29>$A$21,0,$A30),0)+OFFSET(B12,IF($A29>$A$21,0,$A30+1),0))/2","v":{"v":2590.5,"d":"2590.50"}},{"v":2068.5,"d":"2068.50"},{"v":1652,"d":"1652.00"},{"v":1319.5,"d":"1319.50"},{"v":1010,"d":"1010.00"},{"v":792.5,"d":"792.50"},{"v":690,"d":"690.00"},{"v":623.5,"d":"623.50"},{"v":525,"d":"525.00"},{"v":456,"d":"456.00"},{"v":379,"d":"379.00"},{"v":328.5,"d":"328.50"},{"v":276,"d":"276.00"},{"v":223.5,"d":"223.50"},{"v":183.5,"d":"183.50"},{"v":146.5,"d":"146.50"},{"v":115,"d":"115.00"},90.25,71.25,{"v":61.5,"d":"61.50"},{"v":53,"d":"53.00"},{"$f":"(OFFSET(W$5,IF($A29>$A$21,0,$A30),0)+OFFSET(W12,IF($A29>$A$21,0,$A30+1),0))/2","v":{"v":34,"d":"34.00"}}]
[{"$f":"MATCH($A29,$A$6:$A$21,1)","v":2},{"$f":"B29*IF($A29>$A$21,1,0.85)","v":{"v":2201.9249999999997,"d":"2201.93"}},{"v":1758.225,"d":"1758.23"},{"v":1404.2,"d":"1404.20"},{"v":1121.575,"d":"1121.58"},{"v":858.5,"d":"858.50"},{"v":673.625,"d":"673.63"},{"v":586.5,"d":"586.50"},{"v":529.975,"d":"529.98"},446.25,{"v":387.59999999999997,"d":"387.60"},322.15,{"v":279.22499999999997,"d":"279.23"},{"v":234.6,"d":"234.60"},{"v":189.975,"d":"189.98"},{"v":155.975,"d":"155.98"},{"v":124.52499999999999,"d":"124.53"},97.75,{"v":76.71249999999999,"d":"76.71"},{"v":60.5625,"d":"60.56"},{"v":52.275,"d":"52.28"},45.05,{"$f":"W29*IF($A29>$A$21,1,0.85)","v":{"v":28.9,"d":"28.90"}}]

{"sheet":"NH00C-690V","index":8,"n_rows":30,"n_cols":13,"rows_kept":30,"hidden":true}
[]
[]
["NH00C/690V-uf2"]
[]
["(s)",160,125,100,80,63,50,40,32,25,20,16,10]
[10,390,300,240,200,140,115,90,75,59,43,34,30.5]
[60,315,230,200,147,117,92,70,60,45,34,27,23]
[120,290,215,180,137,113,86,65,56,42.5,32.5,25.5,22]
[180,270,210,170,135,110,82,63,53,41.5,31.5,24,21.5]
[240,262,205,165,132,109,80.5,62,52,41,31,23.5,21]
[300,255,200,160,130,105,79,61,51.5,40,30.5,23,20.5]
[600,245,190,150,125,96,74,57,49.5,38,29.5,22.5,20]
[900,240,185,148.5,124,94.5,73,55.5,48,37,29,22,19.5]
[1200,237,180,147,123,93,72.5,54,47,35.5,28,22,19]
[1800,235,177,145,122,92,72,53.5,46,35,27,22,19]
[2400,233,173,143,121,91,71,53,45,34.5,26,22,18.5]
[3000,230,170,140,120,90,70,52.5,44.5,34,26,21.5,18]
[3600,230,170,140,118,89,67,52,44,34,26,21.5,17.5]
[5400,228,167,138,115,85,66,51,43.5,33.5,25,21,17]
[7200,225,165,135,113,84,65,50,43,33,24.5,20.5,16.5]
[9000,220,160,133,110,83,64,50,42,32,24,20,16]
[]
[{"$f":"USV!J22*60","v":900},{"$f":"(OFFSET(B$5,IF($A23>$A$21,0,$A24),0)+OFFSET(B$5,IF($A23>$A$21,0,$A24+1),0))/2","v":{"v":238.5,"d":"238.50"}},{"$f":"(OFFSET(C$5,IF($A23>$A$21,0,$A24),0)+OFFSET(C$5,IF($A23>$A$21,0,$A24+1),0))/2","v":{"v":182.5,"d":"182.50"}},147.75,{"v":123.5,"d":"123.50"},93.75,72.75,54.75,{"v":47.5,"d":"47.50"},36.25,{"v":28.5,"d":"28.50"},{"v":22,"d":"22.00"},19.25]
[{"$f":"MATCH($A23,$A$6:$A$21,1)","v":8},{"$f":"B23*IF($A23>$A$21,1,0.85)","v":{"v":202.725,"d":"202.73"}},{"$f":"C23*IF($A23>$A$21,1,0.85)","v":{"v":155.125,"d":"155.13"}},{"v":125.58749999999999,"d":"125.59"},{"v":104.975,"d":"104.98"},{"v":79.6875,"d":"79.69"},{"v":61.8375,"d":"61.84"},{"v":46.5375,"d":"46.54"},{"v":40.375,"d":"40.38"},{"v":30.8125,"d":"30.81"},{"v":24.224999999999998,"d":"24.23"},{"v":18.7,"d":"18.70"},{"v":16.3625,"d":"16.36"}]
[]
[{"$f":"USV!M24*60","v":600},{"$f":"(OFFSET(B$5,IF($A26>$A$21,0,$A27),0)+OFFSET(B$5,IF($A26>$A$21,0,$A27+1),0))/2","v":{"v":242.5,"d":"242.50"}},{"$f":"(OFFSET(C$5,IF($A26>$A$21,0,$A27),0)+OFFSET(C$5,IF($A26>$A$21,0,$A27+1),0))/2","v":{"v":187.5,"d":"187.50"}},{"$f":"(OFFSET(D$5,IF($A26>$A$21,0,$A27),0)+OFFSET(D$5,IF($A26>$A$21,0,$A27+1),0))/2","v":149.25},{"$f":"(OFFSET(E$5,IF($A26>$A$21,0,$A27),0)+OFFSET(E$5,IF($A26>$A$21,0,$A27+1),0))/2","v":{"v":124.5,"d":"124.50"}},{"$f":"(OFFSET(F$5,IF($A26>$A$21,0,$A27),0)+OFFSET(F$5,IF($A26>$A$21,0,$A27+1),0))/2","v":95.25},{"$f":"(OFFSET(G$5,IF($A26>$A$21,0,$A27),0)+OFFSET(G$5,IF($A26>$A$21,0,$A27+1),0))/2","v":{"v":73.5,"d":"73.50"}},{"$f":"(OFFSET(H$5,IF($A26>$A$21,0,$A27),0)+OFFSET(H$5,IF($A26>$A$21,0,$A27+1),0))/2","v":56.25},{"$f":"(OFFSET(I$5,IF($A26>$A$21,0,$A27),0)+OFFSET(I$5,IF($A26>$A$21,0,$A27+1),0))/2","v":48.75},{"$f":"(OFFSET(J$5,IF($A26>$A$21,0,$A27),0)+OFFSET(J$5,IF($A26>$A$21,0,$A27+1),0))/2","v":{"v":37.5,"d":"37.50"}},{"$f":"(OFFSET(K$5,IF($A26>$A$21,0,$A27),0)+OFFSET(K$5,IF($A26>$A$21,0,$A27+1),0))/2","v":29.25},{"$f":"(OFFSET(L$5,IF($A26>$A$21,0,$A27),0)+OFFSET(L$5,IF($A26>$A$21,0,$A27+1),0))/2","v":22.25},{"$f":"(OFFSET(M$5,IF($A26>$A$21,0,$A27),0)+OFFSET(M$5,IF($A26>$A$21,0,$A27+1),0))/2","v":19.75}]
[{"$f":"MATCH($A26,$A$6:$A$21,1)","v":7},{"$f":"B26*IF($A26>$A$21,1,0.85)","v":{"v":206.125,"d":"206.13"}},{"$f":"C26*IF($A26>$A$21,1,0.85)","v":{"v":159.375,"d":"159.38"}},{"$f":"D26*IF($A26>$A$21,1,0.85)","v":{"v":126.8625,"d":"126.86"}},{"$f":"E26*IF($A26>$A$21,1,0.85)","v":{"v":105.825,"d":"105.83"}},{"$f":"F26*IF($A26>$A$21,1,0.85)","v":{"v":80.96249999999999,"d":"80.96"}},{"$f":"G26*IF($A26>$A$21,1,0.85)","v":{"v":62.475,"d":"62.48"}},{"$f":"H26*IF($A26>$A$21,1,0.85)","v":{"v":47.8125,"d":"47.81"}},{"$f":"I26*IF($A26>$A$21,1,0.85)","v":{"v":41.4375,"d":"41.44"}},{"$f":"J26*IF($A26>$A$21,1,0.85)","v":{"v":31.875,"d":"31.88"}},{"$f":"K26*IF($A26>$A$21,1,0.85)","v":{"v":24.8625,"d":"24.86"}},{"$f":"L26*IF($A26>$A$21,1,0.85)","v":{"v":18.912499999999998,"d":"18.91"}},{"$f":"M26*IF($A26>$A$21,1,0.85)","v":{"v":16.787499999999998,"d":"16.79"}}]
[]
[{"$f":"USV!O24*60","v":60},{"$f":"(OFFSET(B$5,IF($A29>$A$21,0,$A30),0)+OFFSET(B$5,IF($A29>$A$21,0,$A30+1),0))/2","v":{"v":302.5,"d":"302.50"}},{"$f":"(OFFSET(C$5,IF($A29>$A$21,0,$A30),0)+OFFSET(C$5,IF($A29>$A$21,0,$A30+1),0))/2","v":{"v":222.5,"d":"222.50"}},{"$f":"(OFFSET(D$5,IF($A29>$A$21,0,$A30),0)+OFFSET(D$5,IF($A29>$A$21,0,$A30+1),0))/2","v":{"v":190,"d":"190.00"}},{"$f":"(OFFSET(E$5,IF($A29>$A$21,0,$A30),0)+OFFSET(E$5,IF($A29>$A$21,0,$A30+1),0))/2","v":{"v":142,"d":"142.00"}},{"$f":"(OFFSET(F$5,IF($A29>$A$21,0,$A30),0)+OFFSET(F$5,IF($A29>$A$21,0,$A30+1),0))/2","v":{"v":115,"d":"115.00"}},{"$f":"(OFFSET(G$5,IF($A29>$A$21,0,$A30),0)+OFFSET(G$5,IF($A29>$A$21,0,$A30+1),0))/2","v":{"v":89,"d":"89.00"}},{"$f":"(OFFSET(H$5,IF($A29>$A$21,0,$A30),0)+OFFSET(H$5,IF($A29>$A$21,0,$A30+1),0))/2","v":{"v":67.5,"d":"67.50"}},{"$f":"(OFFSET(I$5,IF($A29>$A$21,0,$A30),0)+OFFSET(I$5,IF($A29>$A$21,0,$A30+1),0))/2","v":{"v":58,"d":"58.00"}},{"$f":"(OFFSET(J$5,IF($A29>$A$21,0,$A30),0)+OFFSET(J$5,IF($A29>$A$21,0,$A30+1),0))/2","v":43.75},{"$f":"(OFFSET(K$5,IF($A29>$A$21,0,$A30),0)+OFFSET(K$5,IF($A29>$A$21,0,$A30+1),0))/2","v":33.25},{"$f":"(OFFSET(L$5,IF($A29>$A$21,0,$A30),0)+OFFSET(L$5,IF($A29>$A$21,0,$A30+1),0))/2","v":26.25},{"$f":"(OFFSET(M$5,IF($A29>$A$21,0,$A30),0)+OFFSET(M$5,IF($A29>$A$21,0,$A30+1),0))/2","v":{"v":22.5,"d":"22.50"}}]
[{"$f":"MATCH($A29,$A$6:$A$21,1)","v":2},{"$f":"B29*IF($A29>$A$21,1,0.85)","v":{"v":257.125,"d":"257.13"}},{"$f":"C29*IF($A29>$A$21,1,0.85)","v":{"v":189.125,"d":"189.13"}},{"$f":"D29*IF($A29>$A$21,1,0.85)","v":{"v":161.5,"d":"161.50"}},{"$f":"E29*IF($A29>$A$21,1,0.85)","v":{"v":120.7,"d":"120.70"}},{"$f":"F29*IF($A29>$A$21,1,0.85)","v":97.75},{"$f":"G29*IF($A29>$A$21,1,0.85)","v":{"v":75.64999999999999,"d":"75.65"}},{"$f":"H29*IF($A29>$A$21,1,0.85)","v":{"v":57.375,"d":"57.38"}},{"$f":"I29*IF($A29>$A$21,1,0.85)","v":{"v":49.3,"d":"49.30"}},{"$f":"J29*IF($A29>$A$21,1,0.85)","v":{"v":37.1875,"d":"37.19"}},{"$f":"K29*IF($A29>$A$21,1,0.85)","v":{"v":28.2625,"d":"28.26"}},{"$f":"L29*IF($A29>$A$21,1,0.85)","v":{"v":22.3125,"d":"22.31"}},{"$f":"M29*IF($A29>$A$21,1,0.85)","v":{"v":19.125,"d":"19.13"}}]

{"sheet":"NH1-3-690V","index":9,"n_rows":30,"n_cols":18,"rows_kept":30,"hidden":true}
[]
[]
["NH1-3/690V-uf2"]
[{"$nulls":17},"NH000"]
["(s)",630,500,425,400,350,315,250,200,160,125,100,80,63,50,40,35,25]
[10,1700,1350,1250,1200,1100,1000,790,620,490,370,315,235,170,125,105,84,59]
[60,1210,1010,930,860,745,700,550,440,335,255,220,170,120,92,73,60,45]
[120,1170,960,850,800,700,630,516,417,317,233,200,150,115,84,67,54,42.5]
[180,1150,900,800,730,640,600,480,390,295,223,190,140,110,79,62.5,51.5,41.5]
[240,1100,860,770,720,625,580,460,370,285,220,181,135,102,76,61.5,50,41]
[300,1050,835,735,700,610,560,440,355,270,215,170,131,100,73,60,48,40]
[600,930,780,680,630,550,520,417,328,245,200,155,125,92,69,53.5,44,38]
[900,900,730,650,615,530,500,400,320,237,185,149,121,88,65,52,43,37]
[1200,860,725,630,600,520,490,390,315,231,182,144,120,85,63.5,51.5,42,35.5]
[1800,835,700,617,570,510,460,361,300,224,171,139,119,82,62,49,40,35]
[2400,820,670,605,558,495,446,352,290,223,168,137,118,81,60,47,39.5,34.5]
[3000,810,660,600,550,490,445,350,285,222,165,135,117,80,60,46.5,39,34]
[3600,800,650,590,540,480,440,342,280,220,163,133,115,79,59,46,38,34]
[5400,780,635,565,530,465,430,335,273,212,155,130,110,76,56.5,44,36.5,33.5]
[7200,750,625,550,525,450,420,330,268,210,153,129,108,74,55,44,36,33]
[9000,740,620,540,520,450,420,325,260,205,150,125,105,73,53.5,44,35,32]
[]
[{"$f":"USV!J22*60","v":900},{"$f":"(OFFSET(B$5,IF($A23>$A$21,0,$A24),0)+OFFSET(B$5,IF($A23>$A$21,0,$A24+1),0))/2","v":{"v":880,"d":"880.00"}},{"$f":"(OFFSET(C$5,IF($A23>$A$21,0,$A24),0)+OFFSET(C$5,IF($A23>$A$21,0,$A24+1),0))/2","v":{"v":727.5,"d":"727.50"}},{"v":640,"d":"640.00"},{"v":607.5,"d":"607.50"},{"v":525,"d":"525.00"},{"v":495,"d":"495.00"},{"v":395,"d":"395.00"},{"v":317.5,"d":"317.50"},{"v":234,"d":"234.00"},{"v":183.5,"d":"183.50"},{"v":146.5,"d":"146.50"},{"v":120.5,"d":"120.50"},{"v":86.5,"d":"86.50"},64.25,51.75,{"v":42.5,"d":"42.50"},36.25]
[{"$f":"MATCH($A23,$A$6:$A$21,1)","v":8},{"$f":"B23*IF($A23>$A$21,1,0.85)","v":{"v":748,"d":"748.00"}},{"$f":"C23*IF($A23>$A$21,1,0.85)","v":{"v":618.375,"d":"618.38"}},{"v":544,"d":"544.00"},{"v":516.375,"d":"516.38"},446.25,420.75,335.75,{"v":269.875,"d":"269.88"},{"v":198.9,"d":"198.90"},{"v":155.975,"d":"155.98"},{"v":124.52499999999999,"d":"124.53"},{"v":102.425,"d":"102.43"},{"v":73.52499999999999,"d":"73.53"},{"v":54.6125,"d":"54.61"},{"v":43.9875,"d":"43.99"},{"v":36.125,"d":"36.13"},{"v":30.8125,"d":"30.81"}]
[]
[{"$f":"USV!M24*60","v":600},{"$f":"(OFFSET(B$5,IF($A26>$A$21,0,$A27),0)+OFFSET(B$5,IF($A26>$A$21,0,$A27+1),0))/2","v":{"v":915,"d":"915.00"}},{"$f":"(OFFSET(C$5,IF($A26>$A$21,0,$A27),0)+OFFSET(C$5,IF($A26>$A$21,0,$A27+1),0))/2","v":{"v":755,"d":"755.00"}},{"$f":"(OFFSET(D$5,IF($A26>$A$21,0,$A27),0)+OFFSET(D$5,IF($A26>$A$21,0,$A27+1),0))/2","v":{"v":665,"d":"665.00"}},{"$f":"(OFFSET(E$5,IF($A26>$A$21,0,$A27),0)+OFFSET(E$5,IF($A26>$A$21,0,$A27+1),0))/2","v":{"v":622.5,"d":"622.50"}},{"$f":"(OFFSET(F$5,IF($A26>$A$21,0,$A27),0)+OFFSET(F$5,IF($A26>$A$21,0,$A27+1),0))/2","v":{"v":540,"d":"540.00"}},{"$f":"(OFFSET(G$5,IF($A26>$A$21,0,$A27),0)+OFFSET(G$5,IF($A26>$A$21,0,$A27+1),0))/2","v":{"v":510,"d":"510.00"}},{"$f":"(OFFSET(H$5,IF($A26>$A$21,0,$A27),0)+OFFSET(H$5,IF($A26>$A$21,0,$A27+1),0))/2","v":{"v":408.5,"d":"408.50"}},{"$f":"(OFFSET(I$5,IF($A26>$A$21,0,$A27),0)+OFFSET(I$5,IF($A26>$A$21,0,$A27+1),0))/2","v":{"v":324,"d":"324.00"}},{"$f":"(OFFSET(J$5,IF($A26>$A$21,0,$A27),0)+OFFSET(J$5,IF($A26>$A$21,0,$A27+1),0))/2","v":{"v":241,"d":"241.00"}},{"$f":"(OFFSET(K$5,IF($A26>$A$21,0,$A27),0)+OFFSET(K$5,IF($A26>$A$21,0,$A27+1),0))/2","v":{"v":192.5,"d":"192.50"}},{"$f":"(OFFSET(L$5,IF($A26>$A$21,0,$A27),0)+OFFSET(L$5,IF($A26>$A$21,0,$A27+1),0))/2","v":{"v":152,"d":"152.00"}},{"$f":"(OFFSET(M$5,IF($A26>$A$21,0,$A27),0)+OFFSET(M$5,IF($A26>$A$21,0,$A27+1),0))/2","v":{"v":123,"d":"123.00"}},{"$f":"(OFFSET(N$5,IF($A26>$A$21,0,$A27),0)+OFFSET(N$5,IF($A26>$A$21,0,$A27+1),0))/2","v":{"v":90,"d":"90.00"}},{"$f":"(OFFSET(O$5,IF($A26>$A$21,0,$A27),0)+OFFSET(O$5,IF($A26>$A$21,0,$A27+1),0))/2","v":{"v":67,"d":"67.00"}},{"$f":"(OFFSET(P$5,IF($A26>$A$21,0,$A27),0)+OFFSET(P$5,IF($A26>$A$21,0,$A27+1),0))/2","v":52.75},{"$f":"(OFFSET(Q$5,IF($A26>$A$21,0,$A27),0)+OFFSET(Q$5,IF($A26>$A$21,0,$A27+1),0))/2","v":{"v":43.5,"d":"43.50"}},{"v":37.5,"d":"37.50"}]
[{"$f":"MATCH($A26,$A$6:$A$21,1)","v":7},{"$f":"B26*IF($A26>$A$21,1,0.85)","v":777.75},{"$f":"C26*IF($A26>$A$21,1,0.85)","v":641.75},{"$f":"D26*IF($A26>$A$21,1,0.85)","v":565.25},{"$f":"E26*IF($A26>$A$21,1,0.85)","v":{"v":529.125,"d":"529.13"}},{"$f":"F26*IF($A26>$A$21,1,0.85)","v":{"v":459,"d":"459.00"}},{"$f":"G26*IF($A26>$A$21,1,0.85)","v":{"v":433.5,"d":"433.50"}},{"$f":"H26*IF($A26>$A$21,1,0.85)","v":{"v":347.22499999999997,"d":"347.23"}},{"$f":"I26*IF($A26>$A$21,1,0.85)","v":{"v":275.4,"d":"275.40"}},{"$f":"J26*IF($A26>$A$21,1,0.85)","v":204.85},{"$f":"K26*IF($A26>$A$21,1,0.85)","v":{"v":163.625,"d":"163.63"}},{"$f":"L26*IF($A26>$A$21,1,0.85)","v":{"v":129.2,"d":"129.20"}},{"$f":"M26*IF($A26>$A$21,1,0.85)","v":104.55},{"$f":"N26*IF($A26>$A$21,1,0.85)","v":{"v":76.5,"d":"76.50"}},{"$f":"O26*IF($A26>$A$21,1,0.85)","v":{"v":56.949999999999996,"d":"56.95"}},{"$f":"P26*IF($A26>$A$21,1,0.85)","v":{"v":44.8375,"d":"44.84"}},{"$f":"Q26*IF($A26>$A$21,1,0.85)","v":{"v":36.975,"d":"36.98"}},{"v":31.875,"d":"31.88"}]
[]
[{"$f":"USV!O24*60","v":60},{"$f":"(OFFSET(B$5,IF($A29>$A$21,0,$A30),0)+OFFSET(B$5,IF($A29>$A$21,0,$A30+1),0))/2","v":{"v":1190,"d":"1190.00"}},{"$f":"(OFFSET(C$5,IF($A29>$A$21,0,$A30),0)+OFFSET(C$5,IF($A29>$A$21,0,$A30+1),0))/2","v":{"v":985,"d":"985.00"}},{"$f":"(OFFSET(D$5,IF($A29>$A$21,0,$A30),0)+OFFSET(D$5,IF($A29>$A$21,0,$A30+1),0))/2","v":{"v":890,"d":"890.00"}},{"$f":"(OFFSET(E$5,IF($A29>$A$21,0,$A30),0)+OFFSET(E$5,IF($A29>$A$21,0,$A30+1),0))/2","v":{"v":830,"d":"830.00"}},{"$f":"(OFFSET(F$5,IF($A29>$A$21,0,$A30),0)+OFFSET(F$5,IF($A29>$A$21,0,$A30+1),0))/2","v":{"v":722.5,"d":"722.50"}},{"$f":"(OFFSET(G$5,IF($A29>$A$21,0,$A30),0)+OFFSET(G$5,IF($A29>$A$21,0,$A30+1),0))/2","v":{"v":665,"d":"665.00"}},{"$f":"(OFFSET(H$5,IF($A29>$A$21,0,$A30),0)+OFFSET(H$5,IF($A29>$A$21,0,$A30+1),0))/2","v":{"v":533,"d":"533.00"}},{"$f":"(OFFSET(I$5,IF($A29>$A$21,0,$A30),0)+OFFSET(I$5,IF($A29>$A$21,0,$A30+1),0))/2","v":{"v":428.5,"d":"428.50"}},{"$f":"(OFFSET(J$5,IF($A29>$A$21,0,$A30),0)+OFFSET(J$5,IF($A29>$A$21,0,$A30+1),0))/2","v":{"v":326,"d":"326.00"}},{"$f":"(OFFSET(K$5,IF($A29>$A$21,0,$A30),0)+OFFSET(K$5,IF($A29>$A$21,0,$A30+1),0))/2","v":{"v":244,"d":"244.00"}},{"$f":"(OFFSET(L$5,IF($A29>$A$21,0,$A30),0)+OFFSET(L$5,IF($A29>$A$21,0,$A30+1),0))/2","v":{"v":210,"d":"210.00"}},{"$f":"(OFFSET(M$5,IF($A29>$A$21,0,$A30),0)+OFFSET(M$5,IF($A29>$A$21,0,$A30+1),0))/2","v":{"v":160,"d":"160.00"}},{"$f":"(OFFSET(N$5,IF($A29>$A$21,0,$A30),0)+OFFSET(N$5,IF($A29>$A$21,0,$A30+1),0))/2","v":{"v":117.5,"d":"117.50"}},{"$f":"(OFFSET(O$5,IF($A29>$A$21,0,$A30),0)+OFFSET(O$5,IF($A29>$A$21,0,$A30+1),0))/2","v":{"v":88,"d":"88.00"}},{"$f":"(OFFSET(P$5,IF($A29>$A$21,0,$A30),0)+OFFSET(P$5,IF($A29>$A$21,0,$A30+1),0))/2","v":{"v":70,"d":"70.00"}},{"$f":"(OFFSET(Q$5,IF($A29>$A$21,0,$A30),0)+OFFSET(Q$5,IF($A29>$A$21,0,$A30+1),0))/2","v":{"v":57,"d":"57.00"}},43.75]
[{"$f":"MATCH($A29,$A$6:$A$21,1)","v":2},{"$f":"B29*IF($A29>$A$21,1,0.85)","v":{"v":1011.5,"d":"1011.50"}},{"$f":"C29*IF($A29>$A$21,1,0.85)","v":837.25},{"$f":"D29*IF($A29>$A$21,1,0.85)","v":{"v":756.5,"d":"756.50"}},{"$f":"E29*IF($A29>$A$21,1,0.85)","v":{"v":705.5,"d":"705.50"}},{"$f":"F29*IF($A29>$A$21,1,0.85)","v":{"v":614.125,"d":"614.13"}},{"$f":"G29*IF($A29>$A$21,1,0.85)","v":565.25},{"$f":"H29*IF($A29>$A$21,1,0.85)","v":453.05},{"$f":"I29*IF($A29>$A$21,1,0.85)","v":{"v":364.22499999999997,"d":"364.23"}},{"$f":"J29*IF($A29>$A$21,1,0.85)","v":{"v":277.09999999999997,"d":"277.10"}},{"$f":"K29*IF($A29>$A$21,1,0.85)","v":{"v":207.4,"d":"207.40"}},{"$f":"L29*IF($A29>$A$21,1,0.85)","v":{"v":178.5,"d":"178.50"}},{"$f":"M29*IF($A29>$A$21,1,0.85)","v":{"v":136,"d":"136.00"}},{"$f":"N29*IF($A29>$A$21,1,0.85)","v":{"v":99.875,"d":"99.88"}},{"$f":"O29*IF($A29>$A$21,1,0.85)","v":{"v":74.8,"d":"74.80"}},{"$f":"P29*IF($A29>$A$21,1,0.85)","v":{"v":59.5,"d":"59.50"}},{"$f":"Q29*IF($A29>$A$21,1,0.85)","v":{"v":48.449999999999996,"d":"48.45"}},{"v":37.1875,"d":"37.19"}]

{"sheet":"SE-500V","index":10,"n_rows":29,"n_cols":11,"rows_kept":29,"hidden":true,"merged":[[0,1,0,5],[0,6,0,10]]}
[null,"Anzeiger oben",{"$nulls":4},"Kraftmelder"]
["Bemessungsstrom_A","NH000","NH1","NH2","NH3","NH4a","NH000","NH1","NH2","NH3","NH4a"]
[6,"R5211450","-","-","-","-","R5211413","-","-","-","-"]
[10,"R5211750","-","-","-","-","R5211713","-","-","-","-"]
[16,"R5212250","-","-","-","-","R5212213","-","-","-","-"]
[20,"R5212450","-","-","-","-","R5212413","-","-","-","-"]
[25,"R5212650","-","-","-","-","R5212613","-","-","-","-"]
[32,"R5212950","-","-","-","-","R5212913","-","-","-","-"]
[35,"R5213150","-","-","-","-","R5213113","-","-","-","-"]
[40,"R5213450","-","-","-","-","R5213413","-","-","-","-"]
[50,"R5213550","-","-","-","-","R5213513","-","-","-","-"]
[63,"R5213850","R1213800","-","-","-","R5213813","R1213804","-","-","-"]
[80,"R5214150","R1214100","-","-","-","R5214113","R1214104","-","-","-"]
[100,"R5214350","R1214300","-","-","-","R5214313","R1214304","-","-","-"]
[125,"R5214650","R1214600","R2214600","-","-","R5214613","R1214604","R2214604","-","-"]
[160,"R5214950","R1214900","R2214900","-","-","R5214913","R1214904","R2214904","-","-"]
[200,"-","R1215200","R2215200","-","-","-","R1215204","R2215204","-","-"]
[224,"-","R1215300","R2215300","-","-","-","R1215304","R2215304","-","-"]
[250,"-","R1215600","R2215600","R3215600","-","-","R1215604","R2215604","R3215604","-"]
[315,"-","-","R2215900","R3215900","-","-","-","R2215904","R3215904","-"]
[350,"-","-","R2216000","R3216000","-","-","-","R2216004","R3216004","-"]
[400,"-","-","R2216200","R3216200","-","-","-","R2216204","R3216204","-"]
[425,"-","-","-","R3216300","-","-","-","-","R3216304","-"]
[500,"-","-","-","R3216600","-","-","-","-","R3216604","-"]
[630,"-","-","-","R3216900","-","-","-","-","R3216904","-"]
[800,"-","-","-","-","R4217200","-","-","-","-","R4217204"]
[1000,"-","-","-","-","R4217600","-","-","-","-","R4217604"]
[1250,"-","-","-","-","R4217900","-","-","-","-","R4217904"]
[1500,"-","-","-","-","R4218200","-","-","-","-","R4218204"]

{"sheet":"SE-690V","index":11,"n_rows":29,"n_cols":11,"rows_kept":29,"hidden":true,"merged":[[0,1,0,5],[0,6,0,10]]}
[null,"Anzeiger oben",{"$nulls":4},"Kraftmelder"]
["Bemessungsstrom_A","NH000","NH1","NH2","NH3","NH4a","NH000","NH1","NH2","NH3","NH4a"]
[6,"-","-","-","-","-","-","-","-","-","-"]
[10,"-","-","-","-","-","-","-","-","-","-"]
[16,"R5282250","-","-","-","-","R5282213","-","-","-","-"]
[20,"R5282450","-","-","-","-","R5282413","-","-","-","-"]
[25,"R5282650","-","-","-","-","R5282613","-","-","-","-"]
[32,"R5282950","-","-","-","-","R5282913","-","-","-","-"]
[35,"R5283150","R1283100","-","-","-","R5283113","R1283104","-","-","-"]
[40,"R5283450","R1283400","-","-","-","R5283413","R1283404","-","-","-"]
[50,"R5283550","R1283500","-","-","-","R5283513","R1283504","-","-","-"]
[63,"R5283850","R1283800","-","-","-","R5283813","R1283804","-","-","-"]
[80,"R5284150","R1284100","-","-","-","R5284113","R1284104","-","-","-"]
[100,"R5284350","R1284300","-","-","-","R5284313","R1284304","-","-","-"]
[125,"R5284650","R1284600","R2284600","-","-","R5284613","R1284604","R2284604","-","-"]
[160,"R5284950","R1284900","R2284900","-","-","R5284913","R1284904","R2284904","-","-"]
[200,"-","R1285200","R2285200","-","-","-","R1285204","R2285204","-","-"]
[224,"-","R1285300","R2285300","-","-","-","R1285304","R2285304","-","-"]
[250,"-","R1285600","R2285600","R3285600","-","-","R1285604","R2285604","R3285604","-"]
[315,"-","-","R2285900","R3285900","-","-","-","R2285904","R3285904","-"]
[350,"-","-","R2286000","R3286000","-","-","-","R2286004","R3286004","-"]
[400,"-","-","R2286200","R3286200","-","-","-","R2286204","R3286204","-"]
[425,"-","-","-","R3286300","-","-","-","-","R3286304","-"]
[500,"-","-","-","R3286600","-","-","-","-","R3286604","-"]
[630,"-","-","-","R3286900","-","-","-","-","R3286904","-"]
[800,"-","-","-","-","-","-","-","-","-","-"]
[1000,"-","-","-","-","-","-","-","-","-","-"]
[1250,"-","-","-","-","-","-","-","-","-","-"]
[1500,"-","-","-","-","-","-","-","-","-","-"]

{"sheet":"SE-DC700V","index":12,"n_rows":29,"n_cols":11,"rows_kept":29,"hidden":true,"merged":[[0,1,0,5],[0,6,0,10]]}
[null,"Anzeiger oben",{"$nulls":4},"Kraftmelder"]
["Bemessungsstrom_A","NH000","NH1","NH2","NH3","NH4a","NH000","NH1","NH2","NH3","NH4a"]
[6,"-","-","-","-","-","-","-","-","-","-"]
[10,"-","-","-","-","-","-","-","-","-","-"]
[16,"-","-","-","-","-","-","-","-","-","-"]
[20,"-","-","-","-","-","-","-","-","-","-"]
[25,"-","-","-","-","-","-","-","-","-","-"]
[32,"-","-","-","-","-","-","-","-","-","-"]
[35,"-","-","-","-","-","-","-","-","-","-"]
[40,"-","R1233402","-","-","-","-","R1233403","-","-","-"]
[50,"-","R1233502","-","-","-","-","R1233503","-","-","-"]
[63,"-","R1233802","-","-","-","-","R1233803","-","-","-"]
[80,"-","R1234102","-","-","-","-","R1234103","-","-","-"]
[100,"-","R1234302","-","-","-","-","R1234303","-","-","-"]
[125,"-","R1234602","R2234602","-","-","-","R1234603","R2234603","-","-"]
[160,"-","R1234902","R2234902","-","-","-","R1234903","R2234903","-","-"]
[200,"-","R1235202","R2235202","-","-","-","R1235203","R2235203","-","-"]
[224,"-","R1235302","R2235302","-","-","-","R1235303","R2235303","-","-"]
[250,"-","R1235602","R2235602","R3235602","-","-","R1235603","R2235603","R3235603","-"]
[315,"-","-","R2235902","R3235902","-","-","-","R2235903","R3235903","-"]
[350,"-","-","R2236002","R3236002","-","-","-","R2236003","R3236003","-"]
[400,"-","-","R2236202","R3236202","-","-","-","R2236203","R3236203","-"]
[425,"-","-","-","R3236302","-","-","-","-","R3236303","-"]
[500,"-","-","-","R3236602","-","-","-","-","R3236603","-"]
[630,"-","-","-","R3236902","-","-","-","-","R3236903","-"]
[800,"-","-","-","-","-","-","-","-","-","-"]
[1000,"-","-","-","-","-","-","-","-","-","-"]
[1250,"-","-","-","-","-","-","-","-","-","-"]
[1500,"-","-","-","-","-","-","-","-","-","-"]

{"sheet":"SE-DC800V","index":13,"n_rows":29,"n_cols":11,"rows_kept":29,"hidden":true,"merged":[[0,1,0,5],[0,6,0,10]]}
[null,"Anzeiger oben",{"$nulls":4},"Kraftmelder"]
["Bemessungsstrom_A","NH000","NH1","NH2","NH3","NH4a","NH000","NH1","NH2","NH3","NH4a"]
[6,"-","-","-","-","-","-","-","-","-","-"]
[10,"-","-","-","-","-","-","-","-","-","-"]
[16,"-","-","-","-","-","-","-","-","-","-"]
[20,"-","-","-","-","-","-","-","-","-","-"]
[25,"-","-","-","-","-","-","-","-","-","-"]
[32,"-","-","-","-","-","-","-","-","-","-"]
[35,"-","-","-","-","-","-","-","-","-","-"]
[40,"-","R1233406","-","-","-","-","R1233407","-","-","-"]
[50,"-","R1233506","-","-","-","-","R1233507","-","-","-"]
[63,"-","R1233806","-","-","-","-","R1233807","-","-","-"]
[80,"-","R1234106","-","-","-","-","R1234107","-","-","-"]
[100,"-","R1234306","-","-","-","-","R1234307","-","-","-"]
[125,"-","R1234606","R2234306","-","-","-","R1234607","R2234307","-","-"]
[160,"-","R1234906","R2234906","-","-","-","R1234907","R2234907","-","-"]
[200,"-","R1235206","R2235206","-","-","-","R1235207","R2235207","-","-"]
[224,"-","-","R2235306","-","-","-","-","R2235307","-","-"]
[250,"-","-","R2235606","-","-","-","-","R2235607","-","-"]
[315,"-","-","R2235906","-","-","-","-","R2235907","-","-"]
[350,"-","-","R2236006","-","-","-","-","R2236007","-","-"]
[400,"-","-","R2236206","-","-","-","-","R2236207","-","-"]
[425,"-","-","-","-","-","-","-","-","-","-"]
[500,"-","-","-","-","-","-","-","-","-","-"]
[630,"-","-","-","-","-","-","-","-","-","-"]
[800,"-","-","-","-","-","-","-","-","-","-"]
[1000,"-","-","-","-","-","-","-","-","-","-"]
[1250,"-","-","-","-","-","-","-","-","-","-"]
[1500,"-","-","-","-","-","-","-","-","-","-"]

{"sheet":"KETO","index":14,"n_rows":7,"n_cols":10,"rows_kept":7,"hidden":true}
[null,"1-polig","mech SÜ","2-polig","mech SÜ","3-polig","mech. SÜ","4-polig","mech. SÜ","TM"]
["NH000/NH00","T500111000","T8052170","T500112000","T8052170","T500113000","T8052170","T500114000","T8052170","N8584910"]
["NH1","T100111000","T8092170","T100112000","T8092170","T100113000","T8092170","T100114000","T8092170","N8185610"]
["NH2","T300111000","T8092170","T300112000","T8092170","T200113000","T8092170","T300114000","T8092170","N8286210"]
["NH3","T300111000","T8092170","T300112000","T8092170","T300113000","T8092170","T300114000","T8092170","N8386910"]
["NH4a","T4911004","T8420057","T4911019","T8420057","T4911000","T8420057","T4911017","T8420057","N8417900"]
["NH4a (1600A)","T4911005","T8420057","T4911031","T8420057","T4911001","T8420057","T4911018","T8420057","N8418300"]